program: Orca
programVersion: 5.0.2
elementType: O O O N C C C C C C C C C C C C C C C C C C C C C C H H H H H H H H H H H H H H H H H H H H H H H
charge: 0
multiplicity: 1
keywords: wb97x-d3
keywords: def2-TZVPP
keywords: def2/J RIJCOSX
keywords: DEFGRID2
keywords: scfconv7
keywords: smallprint printgap noloewdin
keywords: NOSOSCF
formula: C22H23NO3
InChI: InChI=1/C22H23NO3/c1-21(2)19(22(21,3)4)20(24)26-18(14-23)15-9-8-12-17(13-15)25-16-10-6-5-7-11-16/h5-13,18-19H,1-4H3
49 atoms
O  0.342335 1.932992 0.142812
O  0.367534 2.186672 -2.066974
O  -2.370768 -2.317105 -0.684549
N  -1.545268 2.816655 2.684062
C  3.367469 1.572532 0.072557
C  2.867277 0.194819 -0.21979
C  2.326982 1.377895 -1.030313
C  3.036478 2.261655 1.378172
C  4.737189 1.994211 -0.41741
C  3.731129 -0.774168 -0.999071
C  2.004824 -0.552469 0.771994
C  0.943226 1.862511 -1.053227
C  -1.008803 2.353203 0.166625
C  -1.979239 1.315503 -0.358046
C  -1.294069 2.607671 1.581248
C  -1.67715 -0.036386 -0.253929
C  -3.184851 1.737281 -0.897006
C  -2.598422 -0.971424 -0.704853
C  -4.099253 0.788642 -1.334052
C  -3.815497 -0.562687 -1.240703
C  -1.329296 -2.832148 0.05702
C  -0.337903 -3.533542 -0.611217
C  -1.308072 -2.702629 1.439235
C  0.687677 -4.122044 0.118201
C  -0.270576 -3.282654 2.154408
C  0.727454 -3.994684 1.499356
H  2.740342 1.435296 -2.031372
H  2.133126 1.913292 1.867917
H  3.860607 2.102185 2.076529
H  2.941768 3.339244 1.232826
H  4.808698 3.0835 -0.436781
H  5.514071 1.626167 0.25583
H  4.967346 1.638217 -1.419747
H  4.278026 -0.30923 -1.816626
H  4.458718 -1.249835 -0.338075
H  3.113326 -1.564839 -1.429493
H  1.378773 0.067752 1.404575
H  1.355749 -1.255496 0.246976
H  2.647368 -1.139647 1.430954
H  -1.143792 3.297853 -0.371193
H  -0.732843 -0.353091 0.167686
H  -3.40919 2.793268 -0.975603
H  -5.042934 1.105819 -1.757241
H  -4.526725 -1.300137 -1.58927
H  -0.371345 -3.625726 -1.689474
H  -2.091219 -2.158122 1.952647
H  1.46046 -4.674622 -0.400386
H  -0.249041 -3.18251 3.231559
H  1.530631 -4.448413 2.06466
elementType: O N C H
totalener: -1132.68134848 hartree
nucrepener: 2351.98694702 hartree
electener: -3484.66829551 hartree
oneelecener: -6212.61922409 hartree
twoeener: 2727.95092859 hartree
cpcmener: -0.03549337 hartree
kineticenergy: 1127.64575853 hartree
xcener: -110.662560293812 hartree
chargesum: -0.0000000
charge: -0.274463 -0.479715 -0.334334 -0.100212 0.117491 0.164674 -0.148266 -0.289729 -0.293976 -0.298593 -0.324827 0.408807 0.359774 -0.006352 -0.221125 -0.158131 -0.223208 0.285367 -0.104917 -0.250784 0.256651 -0.184472 -0.176857 -0.152279 -0.147904 -0.172481 0.086015 0.089528 0.097107 0.103394 0.096670 0.099349 0.092586 0.095383 0.100343 0.093686 0.103467 0.051817 0.117965 0.149885 0.127537 0.147452 0.161720 0.149401 0.147941 0.157038 0.159378 0.161065 0.161139
qa: -0.2745 -0.4797 -0.3343 -0.1002 0.1175 0.1647 -0.1483 -0.2897 -0.2940 -0.2986 -0.3248 0.4088 0.3598 -0.0064 -0.2211 -0.1581 -0.2232 0.2854 -0.1049 -0.2508 0.2567 -0.1845 -0.1769 -0.1523 -0.1479 -0.1725 0.0860 0.0895 0.0971 0.1034 0.0967 0.0993 0.0926 0.0954 0.1003 0.0937 0.1035 0.0518 0.1180 0.1499 0.1275 0.1475 0.1617 0.1494 0.1479 0.1570 0.1594 0.1611 0.1611
va: 2.1165 2.0208 2.0839 3.1070 3.7041 3.6242 3.9294 3.9104 3.9110 3.9179 3.9125 4.1131 3.7625 3.6790 4.0676 3.9026 3.9843 3.7322 3.8905 3.9867 3.6893 3.9408 3.9050 3.8569 3.8479 3.8392 1.0303 1.0067 0.9988 1.0005 1.0014 0.9986 1.0058 1.0063 0.9982 1.0017 1.0062 1.0115 0.9972 1.0159 1.0188 1.0007 0.9873 1.0070 1.0043 0.9964 0.9903 0.9898 0.9902
dispcorr: -0.028764948 hartree
energy: -1132.710113430117
dipole: 27.75892 -26.30496 1.45396 -2.74938 1.91225 -0.83713 1.61250 -1.88697 -0.27447
magnitude: 1.70003 au
magnitude: 4.32114 debye
