program: Gaussian 09
title: 000074687
version: EM64L-G09RevD.01
frameworkgroup: C1[X(C6H7ClNO3P)]
method: RPBEPBE
basis: SDD
operation: Freq
keyword: #p
keyword: freq=noraman
keyword: PBEPBE/SDD
title: #p freq=noraman PBEPBE/SDD
converged: YES YES NO NO
title: Mulliken charges:
elementType: Cl P O O O N C C C C C C H H H H H H H
charge: -0.062189 1.341733 -0.635602 -0.691047 -0.590984 -0.897736 0.602659 -0.397292 -0.358927 -0.182815 -0.199176 -0.117301 0.378851 0.232459 0.271075 0.255253 0.255618 0.392096 0.403324
chargesum: 0.00000
title: Mulliken charges with hydrogens summed into heavy atoms:
elementType: Cl P O O O N C C C C C C
charge: -0.062189 1.341733 -0.243506 -0.287723 -0.590984 -0.518884 0.602659 -0.164833 -0.087852 0.072439 0.056441 -0.117301
polarizability: 1.71544193e+02 -2.99722416e+00 1.06740984e+02 5.44067653e+00 2.94560872e+00 6.01156172e+01
1716.lowfreq: -11.9946 -7.5593 -5.2156 -0.0029 -0.0028 0.0009 23.0799 36.4013 84.6455
frequency: 22.6881 36.2931 84.6346 92.1161 131.9648 199.8750 224.5078 259.4763 288.1716 316.3893 323.6454 340.6888 374.3948 385.1596 409.1667 458.8541 486.1130 527.2665 618.2976 648.2488 673.1071 701.7864 743.2981 784.1883 812.3191 831.2378 895.4483 938.4137 954.6353 993.0248 998.9628 1003.9343 1074.6891 1097.8962 1116.5786 1190.1605 1253.4754 1299.9001 1340.7031 1398.0599 1438.0478 1485.2914 1593.0250 1611.6688 3135.2376 3139.1117 3171.0267 3173.9868 3560.2125 3581.1113 3628.1730
redmass: 6.9658 6.0018 8.4273 3.0096 2.1432 10.6259 10.6250 3.2646 3.2961 2.5697 7.6704 3.2925 3.6384 2.0202 3.0254 5.3845 1.8039 2.1294 6.9254 7.0633 12.0371 3.4220 7.9697 5.6159 1.2832 1.6580 4.8399 1.3591 1.3553 3.8059 1.9112 1.1926 2.6073 2.8059 1.3399 1.1183 1.8602 1.3886 3.0356 4.1351 1.9398 2.6816 6.7907 6.3002 1.0900 1.0909 1.0953 1.0962 1.0759 1.0660 1.0667
irintensity: 0.5261 1.3337 0.8551 16.1393 21.9008 1.5997 14.6043 23.6998 83.9148 94.2831 21.6308 107.9990 16.4251 51.0721 0.5400 7.1867 105.0491 13.9213 1.6318 5.4676 153.6428 4.2513 298.5418 59.5036 15.3749 128.9544 114.4122 2.6299 1.0124 26.0495 1.4822 47.1874 47.2712 177.5349 28.3054 6.3083 34.1604 20.9038 118.8961 19.6982 27.5454 288.0498 0.7797 50.9826 9.7059 3.5838 4.6598 0.2848 60.8490 58.0684 97.4879
temp: 298.150 k
press: 1.00000 atm
elementType: 17 15 8 8 8 7 6 6 6 6 6 6 1 1 1 1 1 1 1
symmnumber: 1
zpe: 334037.2 jmol-1
zpe.correction: 0.127228 hartree
zpe.thermalcorrener: 0.140074 hartree
zpe.thermalcorrenthalpy: 0.141018 hartree
zpe.thermalcorrgfe: 0.086164 hartree
zpe.sumelectzpe: -1313.653443 hartree
zpe.sumelectthermal: -1313.640597 hartree
zpe.sumelectthermalent: -1313.639652 hartree
zpe.sumelectthermalfe: -1313.694506 hartree
dipole: -3.0804 1.4235 0.6520
dipole: 3.4555
quadrupole: -79.1426 -77.6133 -89.7945
quadrupole: 1.2158 -2.1207 -6.4797
quadrupole: 3.0409 4.5702 -7.6110 1.2158 -2.1207 -6.4797
hfenergy: -1313.7806707 hartree
pointgroup: C01 [X(C6H7Cl1N1O3P1)]
dipole: -1.194165 0.5868074 0.279061 debye
dipolederiv: -0.8615684 0.1435352 -0.0283612 0.1732101 -0.1620876 0.0001309 -0.037503 0.0025545 -0.072931 2.776878 -0.0316509 0.0002008 0.566548 1.6422071 -0.2077083 -0.2266264 -0.2375126 1.9038608 -0.7469013 0.087898 0.0569155 -0.1069432 -0.4609587 0.1762521 0.252518 0.212721 -1.0583223 -1.1505813 0.3216432 -0.0162727 0.442241 -0.6830962 0.1113383 0.019599 0.080614 -0.6818911 -0.8169099 -0.0328243 -0.0253198 -0.0764942 -0.6364546 -0.0398841 0.0570404 0.0085943 -0.6747853 -1.9714103 0.0476603 0.0034637 -0.1874028 -0.5085353 0.0160341 -0.0951725 0.0058815 -0.6552794 1.5840983 -0.1174175 0.0271204 -0.5291399 -0.0024024 0.0282043 0.0714028 -0.0079328 0.1426083 -0.3521047 0.0472207 0.0162019 -0.129666 0.0775268 0.0285105 0.0361194 0.0340114 -0.1972895 -0.2188816 -0.025522 0.005421 0.3274392 -0.0212275 0.0177179 0.0137483 0.0382135 -0.1697198 -0.139319 0.0149377 -0.0025671 0.0721772 0.0450369 0.0192214 0.0032626 0.0192623 -0.078593 -0.1535382 0.0795135 0.0081144 -0.0135534 0.0647303 0.0235044 -0.0142454 0.0276904 -0.0789788 1.108636 -0.2535985 0.0534467 -0.2632366 0.0393267 -0.0079707 0.0591516 -0.0120235 -0.0954891 0.1150704 -0.0768222 0.0178145 -0.0591918 0.1922828 0.0091772 -0.0544118 -0.0083769 0.3511651 0.0380301 0.0917405 -0.0011498 0.0751968 -0.0619613 -0.024053 0.0031296 -0.0254789 0.1641395 0.0357225 -0.0633491 -0.0238484 -0.0681463 0.0519677 -0.0144622 -0.0234071 -0.0269229 0.1535786 0.0192511 -0.0768697 -0.0165743 -0.0678545 0.0300342 -0.0187144 -0.0243175 -0.0157712 0.1609496 0.0800552 0.040695 -0.0007125 0.0476629 -0.0225548 -0.0193011 0.0056125 -0.017848 0.1591618 0.3310354 -0.0687773 -0.0403673 -0.1140689 0.1679242 -0.0590268 0.0077379 -0.0267393 0.3319168 0.3224375 -0.1280126 -0.0335257 -0.0887776 0.2482418 -0.0389705 -0.0536386 -0.0509369 0.3958988 unknown
polarizability: 171.4121823|-4.8399767|106.8026199|4.540583|3.8783361|60.1859917 unknown
InChI: InChI=1S/C6H7ClNO3P/c7-5-1-3-6(4-2-5)8-12(9,10)11/h1-4,8-10H
charge 0 multiplicity 1
19 atoms
Cl 4.55572 -0.602202 0.097209
P  -2.657573 -0.217864 0.034602
O  -2.605641 -0.575329 1.725517
O  -3.845405 1.015459 -0.157342
O  -2.843699 -1.529634 -0.847414
N  -1.322853 0.83861 -0.173426
C  0.049095 0.477212 -0.107768
C  1.021208 1.495733 0.069555
C  0.465176 -0.874405 -0.232674
C  2.39316 1.17185 0.122955
C  1.835048 -1.201979 -0.162291
C  2.782842 -0.176291 0.014036
H  -1.562635 1.827386 -0.271365
H  0.710528 2.541562 0.175371
H  -0.26813 -1.668363 -0.413196
H  3.141774 1.957802 0.257917
H  2.156979 -2.242707 -0.25862
H  -2.958963 -1.475399 1.946968
H  -4.735431 0.696059 -0.446234
