program: Orca
programVersion: 5.0.2
elementType: O O O N C C C C C C C C C C C C C C C C C C C C C C H H H H H H H H H H H H H H H H H H H H H H H
charge: 0
multiplicity: 1
keywords: wb97x-d3
keywords: def2-TZVPP
keywords: def2/J RIJCOSX
keywords: DEFGRID2
keywords: scfconv7
keywords: smallprint printgap noloewdin
keywords: NOSOSCF
formula: C22H23NO3
InChI: InChI=1/C22H23NO3/c1-21(2)19(22(21,3)4)20(24)26-18(14-23)15-9-8-12-17(13-15)25-16-10-6-5-7-11-16/h5-13,18-19H,1-4H3
49 atoms
O  0.11817 2.461382 0.270614
O  1.045176 0.459892 0.592255
O  -2.684398 -2.380969 -0.956277
N  -0.92739 0.964805 3.182228
C  3.725645 2.020616 -0.052862
C  3.290467 1.431754 -1.354339
C  2.277616 2.209002 -0.51416
C  4.048138 1.141374 1.132502
C  4.565039 3.279072 -0.035503
C  3.688753 2.097537 -2.654225
C  3.177335 -0.064764 -1.534426
C  1.13988 1.583036 0.160249
C  -1.120658 1.993485 0.785379
C  -1.862414 1.115231 -0.196031
C  -0.973949 1.382943 2.111271
C  -1.906599 -0.267728 -0.063245
C  -2.491995 1.741781 -1.263398
C  -2.590897 -1.020531 -1.008243
C  -3.165512 0.975304 -2.203507
C  -3.21977 -0.40241 -2.083544
C  -2.067116 -3.049579 0.082006
C  -2.71826 -3.181881 1.298813
C  -0.813957 -3.602305 -0.127428
C  -2.097371 -3.883079 2.323013
C  -0.206536 -4.308517 0.902361
C  -0.843234 -4.447223 2.128117
H  2.056068 3.203805 -0.883865
H  5.107327 0.877919 1.108251
H  3.871087 1.684184 2.062807
H  3.485049 0.214894 1.183357
H  5.618685 3.034692 -0.185195
H  4.278365 4.001848 -0.796487
H  4.477107 3.775848 0.932354
H  3.643003 3.183903 -2.617748
H  4.705974 1.814345 -2.932216
H  3.026189 1.772677 -3.458432
H  4.111193 -0.440595 -1.95712
H  2.987364 -0.625638 -0.625287
H  2.383105 -0.304724 -2.24333
H  -1.701631 2.905023 0.942971
H  -1.418834 -0.749928 0.772877
H  -2.464794 2.819917 -1.357384
H  -3.660356 1.456211 -3.036491
H  -3.748893 -0.999625 -2.815197
H  -3.696375 -2.741065 1.444893
H  -0.321305 -3.487069 -1.084571
H  -2.598425 -3.98875 3.276099
H  0.769657 -4.747572 0.744116
H  -0.364542 -4.994316 2.929257
elementType: O N C H
totalener: -1132.68288171 hartree
nucrepener: 2289.60499397 hartree
electener: -3422.28787568 hartree
oneelecener: -6089.57130252 hartree
twoeener: 2667.28342684 hartree
cpcmener: -0.03592408 hartree
kineticenergy: 1127.66322630 hartree
xcener: -110.663036363912 hartree
chargesum: 0.0000000
charge: -0.294165 -0.482547 -0.338218 -0.100808 0.096427 0.105952 -0.129388 -0.302039 -0.281170 -0.286651 -0.301377 0.431074 0.477420 -0.076123 -0.240922 -0.143274 -0.253640 0.284148 -0.107749 -0.242858 0.234682 -0.172905 -0.182876 -0.161195 -0.158548 -0.150925 0.087413 0.101579 0.101067 0.097357 0.100054 0.092326 0.095167 0.093346 0.099216 0.096084 0.099162 0.095608 0.101971 0.145890 0.119168 0.147547 0.161184 0.149177 0.154392 0.152605 0.162273 0.162428 0.162659
qa: -0.2942 -0.4825 -0.3382 -0.1008 0.0964 0.1060 -0.1294 -0.3020 -0.2812 -0.2867 -0.3014 0.4311 0.4774 -0.0761 -0.2409 -0.1433 -0.2536 0.2841 -0.1077 -0.2429 0.2347 -0.1729 -0.1829 -0.1612 -0.1585 -0.1509 0.0874 0.1016 0.1011 0.0974 0.1001 0.0923 0.0952 0.0933 0.0992 0.0961 0.0992 0.0956 0.1020 0.1459 0.1192 0.1475 0.1612 0.1492 0.1544 0.1526 0.1623 0.1624 0.1627
va: 2.1307 2.0134 2.0768 3.1060 3.7097 3.6895 3.9452 3.9112 3.9029 3.9079 3.9093 4.0482 3.8183 3.7166 4.0669 3.8711 4.0032 3.7898 3.8928 4.0090 3.7125 3.9424 3.9676 3.8898 3.8914 3.8723 1.0323 0.9979 0.9996 1.0135 0.9987 1.0055 1.0027 1.0054 0.9988 1.0020 0.9985 1.0108 0.9991 0.9931 1.0381 1.0030 0.9878 1.0066 0.9989 1.0010 0.9891 0.9888 0.9885
dispcorr: -0.024790052 hartree
energy: -1132.707671760480
dipole: 29.15651 -28.52192 0.63459 7.77681 -6.35083 1.42598 -8.56765 6.68488 -1.88277
magnitude: 2.44560 au
magnitude: 6.21621 debye
