program: Orca
programVersion: 5.0.2
elementType: O O O N C C C C C C C C C C C C C C C C C C C C C C H H H H H H H H H H H H H H H H H H H H H H H
charge: 0
multiplicity: 1
keywords: wb97x-d3
keywords: def2-TZVPP
keywords: def2/J RIJCOSX
keywords: DEFGRID2
keywords: scfconv7
keywords: smallprint printgap noloewdin
keywords: NOSOSCF
formula: C22H23NO3
InChI: InChI=1/C22H23NO3/c1-21(2)19(22(21,3)4)20(24)26-18(14-23)15-9-8-12-17(13-15)25-16-10-6-5-7-11-16/h5-13,18-19H,1-4H3
49 atoms
O  0.105483 2.475308 0.223215
O  1.033862 0.499753 0.676809
O  -2.599434 -2.363208 -1.008233
N  -1.006409 1.078642 3.175839
C  3.722153 2.001991 -0.029469
C  3.287933 1.362892 -1.307368
C  2.279321 2.186516 -0.50635
C  4.030701 1.170151 1.193433
C  4.575216 3.251014 -0.061815
C  3.700399 1.967875 -2.631874
C  3.15607 -0.138302 -1.423676
C  1.130779 1.596703 0.181939
C  -1.142313 2.04239 0.749688
C  -1.900588 1.151855 -0.207034
C  -1.01524 1.466818 2.092718
C  -1.874546 -0.234903 -0.103522
C  -2.617586 1.769418 -1.223224
C  -2.575977 -0.998585 -1.026783
C  -3.307381 0.992157 -2.142667
C  -3.291271 -0.388476 -2.051741
C  -1.979818 -3.031205 0.028372
C  -2.58958 -3.102334 1.272351
C  -0.765685 -3.652744 -0.213253
C  -1.964739 -3.808128 2.290359
C  -0.155351 -4.3651 0.810906
C  -0.748977 -4.440751 2.063182
H  2.069338 3.166715 -0.919393
H  5.089218 0.902998 1.189242
H  3.846961 1.750147 2.099712
H  3.464372 0.248166 1.275241
H  5.626002 2.989844 -0.203003
H  4.295148 3.946836 -0.849965
H  4.493517 3.785563 0.886258
H  3.033412 1.622954 -3.424011
H  3.674352 3.055486 -2.639183
H  4.712838 1.655435 -2.895431
H  4.093033 -0.547271 -1.806821
H  2.935294 -0.654628 -0.495386
H  2.374161 -0.397336 -2.139645
H  -1.707107 2.968183 0.880833
H  -1.318861 -0.711422 0.69212
H  -2.646345 2.849375 -1.291202
H  -3.871453 1.466777 -2.934214
H  -3.833348 -0.994837 -2.766168
H  -3.538994 -2.610654 1.444052
H  -0.305133 -3.585482 -1.190657
H  -2.433231 -3.864533 3.263948
H  0.790108 -4.858039 0.626833
H  -0.268113 -4.993032 2.859441
elementType: O N C H
totalener: -1132.68260431 hartree
nucrepener: 2290.19575956 hartree
electener: -3422.87836386 hartree
oneelecener: -6090.70560292 hartree
twoeener: 2667.82723905 hartree
cpcmener: -0.03572422 hartree
kineticenergy: 1127.66315579 hartree
xcener: -110.663116592720 hartree
chargesum: 0.0000000
charge: -0.293949 -0.482027 -0.336936 -0.103622 0.097181 0.106387 -0.131164 -0.302232 -0.282318 -0.285128 -0.302786 0.431895 0.471451 -0.069266 -0.236607 -0.148832 -0.247687 0.281380 -0.106888 -0.245081 0.241940 -0.177800 -0.191434 -0.156736 -0.154161 -0.155504 0.087414 0.100918 0.101179 0.097459 0.100080 0.092853 0.095009 0.095715 0.093017 0.099101 0.099283 0.096497 0.101659 0.145209 0.121728 0.147630 0.161659 0.149158 0.156243 0.151145 0.162111 0.162313 0.162542
qa: -0.2939 -0.4820 -0.3369 -0.1036 0.0972 0.1064 -0.1312 -0.3022 -0.2823 -0.2851 -0.3028 0.4319 0.4715 -0.0693 -0.2366 -0.1488 -0.2477 0.2814 -0.1069 -0.2451 0.2419 -0.1778 -0.1914 -0.1567 -0.1542 -0.1555 0.0874 0.1009 0.1012 0.0975 0.1001 0.0929 0.0950 0.0957 0.0930 0.0991 0.0993 0.0965 0.1017 0.1452 0.1217 0.1476 0.1617 0.1492 0.1562 0.1511 0.1621 0.1623 0.1625
va: 2.1330 2.0124 2.0762 3.1050 3.7059 3.6894 3.9470 3.9107 3.9033 3.9067 3.9099 4.0492 3.8215 3.7086 4.0620 3.8829 4.0063 3.7951 3.8906 4.0092 3.7016 3.9364 3.9805 3.8869 3.8884 3.8749 1.0323 0.9980 0.9995 1.0135 0.9986 1.0054 1.0027 1.0021 1.0054 0.9989 0.9987 1.0108 0.9992 0.9936 1.0385 1.0018 0.9877 1.0066 0.9977 1.0024 0.9891 0.9887 0.9887
dispcorr: -0.024745763 hartree
energy: -1132.707350071476
dipole: 29.10311 -28.46570 0.63741 7.15145 -5.80301 1.34844 -8.26247 6.31233 -1.95014
magnitude: 2.45513 au
magnitude: 6.24044 debye
