program: Orca
programVersion: 5.0.2
elementType: O O O N C C C C C C C C C C C C C C C C C C C C C C H H H H H H H H H H H H H H H H H H H H H H H
charge: 0
multiplicity: 1
keywords: wb97x-d3
keywords: def2-TZVPP
keywords: def2/J RIJCOSX
keywords: DEFGRID2
keywords: scfconv7
keywords: smallprint printgap noloewdin
keywords: NOSOSCF
formula: C22H23NO3
InChI: InChI=1/C22H23NO3/c1-21(2)19(22(21,3)4)20(24)26-18(14-23)15-9-8-12-17(13-15)25-16-10-6-5-7-11-16/h5-13,18-19H,1-4H3
49 atoms
O  0.365258 1.3072 -0.607274
O  1.275553 3.120008 0.312348
O  -2.834129 -2.811914 -0.488706
N  -0.856552 1.61874 2.546927
C  3.768742 2.493558 -1.491447
C  3.995203 1.621614 -0.300677
C  2.627704 1.608005 -0.991567
C  3.717017 3.997395 -1.348794
C  4.340131 2.102995 -2.837211
C  4.797264 0.345765 -0.428578
C  4.15905 2.219266 1.0773
C  1.414514 2.124385 -0.3574
C  -0.888889 1.699335 -0.071008
C  -1.944944 0.74709 -0.570002
C  -0.844903 1.666631 1.397337
C  -1.852133 -0.609237 -0.27243
C  -3.00799 1.24224 -1.308961
C  -2.854186 -1.463863 -0.706355
C  -3.995356 0.370338 -1.748605
C  -3.928574 -0.977301 -1.444575
C  -2.219459 -3.344183 0.61938
C  -2.397337 -2.812163 1.890659
C  -1.464788 -4.491937 0.427091
C  -1.795547 -3.438053 2.972946
C  -0.88055 -5.114755 1.521014
C  -1.03675 -4.587872 2.79569
H  2.445777 0.726922 -1.596653
H  3.333298 4.356381 -0.399551
H  4.725713 4.399941 -1.465064
H  3.102185 4.432562 -2.139055
H  3.78925 2.60215 -3.636427
H  5.38374 2.415203 -2.91358
H  4.296703 1.033823 -3.034654
H  5.86514 0.559446 -0.349025
H  4.539653 -0.341501 0.379114
H  4.632308 -0.180948 -1.366307
H  5.216875 2.424253 1.254625
H  3.618201 3.145278 1.244512
H  3.835101 1.507081 1.838644
H  -1.143716 2.719389 -0.372511
H  -1.010886 -0.985986 0.297535
H  -3.068231 2.298607 -1.536269
H  -4.829506 0.746227 -2.325364
H  -4.702693 -1.656474 -1.778096
H  -2.997892 -1.924214 2.043659
H  -1.342098 -4.897176 -0.569569
H  -1.9310 -3.024485 3.963849
H  -0.295232 -6.012363 1.370532
H  -0.575889 -5.072041 3.646227
elementType: O N C H
totalener: -1132.68542457 hartree
nucrepener: 2213.05027825 hartree
electener: -3345.73570282 hartree
oneelecener: -5935.43743870 hartree
twoeener: 2589.70173588 hartree
cpcmener: -0.03488113 hartree
kineticenergy: 1127.64482278 hartree
xcener: -110.657909538750 hartree
chargesum: 0.0000000
charge: -0.295580 -0.479233 -0.334894 -0.107936 0.104378 0.099407 -0.126250 -0.303936 -0.281796 -0.280112 -0.302202 0.410385 0.460188 -0.003226 -0.236495 -0.223051 -0.190447 0.261225 -0.122167 -0.232978 0.303790 -0.212071 -0.256734 -0.139000 -0.120394 -0.190191 0.089262 0.098110 0.099766 0.100864 0.095446 0.099304 0.093590 0.099285 0.095763 0.092591 0.101664 0.097346 0.101102 0.127962 0.149959 0.149729 0.162490 0.150193 0.159417 0.149402 0.163359 0.161566 0.161148
qa: -0.2956 -0.4792 -0.3349 -0.1079 0.1044 0.0994 -0.1262 -0.3039 -0.2818 -0.2801 -0.3022 0.4104 0.4602 -0.0032 -0.2365 -0.2231 -0.1904 0.2612 -0.1222 -0.2330 0.3038 -0.2121 -0.2567 -0.1390 -0.1204 -0.1902 0.0893 0.0981 0.0998 0.1009 0.0954 0.0993 0.0936 0.0993 0.0958 0.0926 0.1017 0.0973 0.1011 0.1280 0.1500 0.1497 0.1625 0.1502 0.1594 0.1494 0.1634 0.1616 0.1611
va: 2.1591 2.0163 2.0763 3.1068 3.6982 3.7100 3.9442 3.9039 3.9058 3.9034 3.9136 4.0750 3.7045 3.7338 4.0203 3.9646 3.9314 3.7653 3.9064 3.9979 3.6579 3.9210 4.0147 3.8773 3.8742 3.9044 1.0309 1.0121 0.9979 0.9996 1.0025 0.9990 1.0052 0.9989 1.0025 1.0057 0.9980 1.0119 0.9996 1.0223 1.0138 1.0020 0.9886 1.0052 0.9965 1.0070 0.9886 0.9880 0.9895
dispcorr: -0.023133360 hartree
energy: -1132.708557933258
dipole: 30.92065 -30.30394 0.61671 8.57051 -9.17019 -0.59968 -7.07411 4.97170 -2.10241
magnitude: 2.27158 au
magnitude: 5.77389 debye
