program: Gaussian 09
title: 000074674
version: EM64L-G09RevD.01
frameworkgroup: C1[X(C10H13NO2)]
method: RPBEPBE
basis: SDD
operation: Freq
keyword: #p
keyword: freq=noraman
keyword: PBEPBE/SDD
title: #p freq=noraman PBEPBE/SDD
converged: YES YES NO NO
title: Mulliken charges:
elementType: O O N C C C C C C C C C C H H H H H H H H H H H H H
charge: -0.187725 -0.201449 -0.013322 0.146884 0.378106 -0.733699 -0.720754 -0.708159 0.201650 -0.352413 -0.340850 -0.255143 -0.234481 0.223878 0.226268 0.207888 0.219762 0.212270 0.246887 0.208880 0.209631 0.271660 0.248092 0.267896 0.235282 0.242962
chargesum: 0.00000
title: Mulliken charges with hydrogens summed into heavy atoms:
elementType: O O N C C C C C C C C C C
charge: -0.187725 -0.201449 -0.013322 0.146884 0.378106 -0.075666 -0.041835 -0.017987 0.201650 -0.104321 -0.072954 -0.019861 0.008481
polarizability: 1.43033290e+02 -5.94269162e+00 1.38847251e+02 -6.53051509e+00 -2.67248000e+00 8.12174686e+01
1716.lowfreq: -0.0009 -0.0008 -0.0006 3.3467 6.0511 12.8740 57.7042 70.2987 93.9650
frequency: 57.6861 70.2577 93.9616 152.1461 184.8971 202.9595 231.4017 254.7576 279.0838 306.6069 310.2934 357.5197 372.7140 383.5545 412.1485 467.2454 534.3694 542.4956 570.4721 642.3836 682.3134 700.5237 753.4400 779.6127 786.6446 838.5773 880.0999 920.6926 929.4197 947.0444 961.0901 994.8922 1018.7180 1028.5436 1049.8270 1053.4250 1121.1046 1137.4050 1180.9840 1199.2815 1214.5419 1231.5967 1251.4156 1282.8042 1358.2352 1364.7254 1376.6023 1382.2624 1409.3136 1424.2622 1457.4697 1463.0095 1470.4866 1475.8055 1490.5680 1498.1737 1511.3980 1573.2873 1604.7601 2976.8857 2981.1791 2991.2778 3066.4723 3071.4649 3075.0918 3082.4413 3121.9358 3125.5150 3140.0739 3158.5824 3176.3315 3187.4480
redmass: 7.3736 3.3330 3.7537 2.0072 3.5335 2.0491 1.1933 2.5673 2.4769 2.3151 1.5778 2.8929 3.7241 3.2887 2.3247 3.5496 2.9456 3.4338 4.1551 6.5410 6.3163 6.3246 2.7497 1.6164 6.0109 2.8704 1.4547 1.7675 1.7238 1.2043 1.3818 1.3430 1.4730 1.4177 2.9788 3.9805 2.1918 1.7317 1.1027 2.9341 2.2062 11.0428 2.7201 1.5362 4.5871 4.1724 1.3058 1.3459 1.2480 2.2577 1.0501 1.4748 1.2012 1.1785 1.0674 1.0879 1.0563 6.0874 6.3509 1.0357 1.0373 1.0389 1.0998 1.0995 1.0998 1.0988 1.0967 1.0965 1.0870 1.0911 1.0967 1.0948
irintensity: 0.8316 0.6040 1.2270 0.5374 1.7770 2.0277 0.2066 0.1990 0.2562 0.4883 0.3278 0.4461 0.8003 0.2500 1.1961 0.7167 1.1274 11.7094 0.9471 6.4434 16.3120 6.3326 20.0861 49.2376 11.2470 8.7895 1.2457 2.7171 3.1463 0.1740 1.7931 0.4633 0.8646 0.5413 20.2442 1.7154 5.1203 1.3791 0.9438 8.1052 10.3749 156.4854 34.5902 1.5080 133.8601 22.2603 6.0595 38.2855 11.1766 10.5428 0.4022 19.8493 4.2130 13.0767 7.6564 14.5978 22.0868 5.3490 8.7146 18.7256 44.1004 29.6945 8.5549 21.0845 37.5219 71.9437 4.1273 11.9794 4.0800 8.8358 7.3404 11.8265
temp: 298.150 k
press: 1.00000 atm
elementType: 8 8 7 6 6 6 6 6 6 6 6 6 6 1 1 1 1 1 1 1 1 1 1 1 1 1
symmnumber: 1
zpe: 552591.1 jmol-1
zpe.correction: 0.210471 hartree
zpe.thermalcorrener: 0.223171 hartree
zpe.thermalcorrenthalpy: 0.224115 hartree
zpe.thermalcorrgfe: 0.172015 hartree
zpe.sumelectzpe: -592.996103 hartree
zpe.sumelectthermal: -592.983403 hartree
zpe.sumelectthermalent: -592.982459 hartree
zpe.sumelectthermalfe: -593.034559 hartree
dipole: -0.2876 -4.4652 -0.1299
dipole: 4.4763
quadrupole: -68.7097 -82.0269 -81.9407
quadrupole: -4.1825 2.5953 -0.3293
quadrupole: 8.8494 -4.4678 -4.3816 -4.1825 2.5953 -0.3293
hfenergy: -593.2065741 hartree
pointgroup: C01[X(C10H13N1O2)]
dipole: 0.5161407 1.6709623 -0.2074541 debye
dipolederiv: -0.3211045 0.0068907 -0.1549814 0.0010808 -0.6690474 0.2776962 -0.192607 0.2064853 -0.5335731 -0.616009 -0.1198475 -0.249164 -0.1950355 -0.5088924 -0.0553435 -0.2458193 0.0631154 -0.4992704 0.6848644 0.3342506 0.4275653 0.3632122 1.1461055 -0.28264 0.428829 -0.3337342 0.8415745 0.1318257 -0.0560761 -0.0286935 -0.1045501 0.147679 0.0108814 -0.1318922 0.0611828 0.0993752 0.3328414 -0.143113 0.0277244 0.1096884 0.0070548 -0.0101294 -0.0507727 -0.1189995 -0.0525392 -0.0249193 0.0621023 0.0066343 0.0188947 -0.0486503 -0.0257233 0.0290758 -0.0289173 0.0566041 -0.0350081 0.0023606 0.0289612 0.0513616 -0.0500592 0.0144354 0.0233641 0.0299341 -0.0059942 -0.0475328 0.0314599 -0.0409328 0.0468434 -0.0409074 -0.0412218 0.0573452 -0.0658887 -0.0252462 -0.0670931 -0.1971918 -0.0215241 -0.1460695 -0.1794789 0.0593782 0.0202847 0.0597372 -0.0439393 -0.3136285 -0.0577935 0.0118763 -0.167005 0.0316718 -0.019653 0.0368781 -0.0312157 -0.121622 -0.0099492 0.1830676 -0.040688 -0.0288565 0.0330511 -0.0364966 0.0622357 0.0666896 -0.100229 0.1076141 0.0474696 -0.0077673 0.0365766 0.1346426 -0.0583005 -0.0266814 -0.0488974 -0.1089561 0.1027516 -0.0404264 0.0059927 0.0359583 -0.2031771 0.0157547 -0.0072038 0.0108442 -0.1591155 -0.1844875 0.0645117 0.0338802 -0.0126653 0.0877865 -0.0017173 0.0309493 -0.0107387 0.0912986 0.0552384 -0.0635159 -0.1019772 -0.0229258 0.0313506 -0.0568993 -0.0902752 -0.0764063 -0.083181 0.0848388 -0.0767441 0.0641419 -0.0411029 -0.027701 0.0890289 0.0561422 0.1195746 -0.0668963 0.0496768 -0.0303575 -0.1098017 -0.0236937 0.0683459 -0.029424 -0.0684948 -0.0146772 -0.1050338 -0.1797891 0.0561382 0.052913 0.090967 0.0777909 -0.0061377 0.0232905 0.0072532 0.0814252 0.1460781 0.0075511 -0.0041479 -0.0256717 -0.1044095 0.0134502 -0.0446271 -0.0180401 0.0624965 -0.2114495 0.0489257 -0.0231078 0.0502783 0.0970963 0.0012149 -0.0033702 -0.002481 0.0670244 0.0651749 -0.0761465 0.0775437 -0.0404386 0.0036311 0.1353494 0.0499622 0.0669778 -0.0669046 0.1406884 0.0108949 0.0254439 -0.0255312 -0.0351172 -0.0871731 0.0402592 -0.0379467 0.0887845 0.1071923 0.0593134 -0.0181835 0.0616478 -0.043779 0.0233691 0.007008 0.0385517 0.1227014 0.081606 0.0220267 0.0089966 0.0516364 0.0021693 0.0200074 -0.0276984 0.0181101 0.1531716 0.0221511 -0.0790595 0.0222968 -0.1006323 -0.0423305 0.0383052 0.0202434 0.0357186 0.1459424 -0.1015712 0.0033088 0.0069988 0.0160325 0.0851745 0.0119884 0.0035746 0.003768 0.1621024 unknown
polarizability: 146.5531426|3.6398399|132.7853467|3.9021809|-12.6725887|83.75952 unknown
InChI: InChI=1S/C10H13NO2/c1-10(2,3)8-6-4-5-7-9(8)11(12)13/h4-7H,1-3H3
charge 0 multiplicity 1
26 atoms
O  0.470439 -2.696868 1.231872
O  -0.867652 -2.29149 -0.563852
N  0.044863 -1.937675 0.278539
C  -1.542162 0.81639 0.014789
C  0.000132 0.616815 -0.064186
C  -1.89636 2.308017 0.295261
C  -2.177847 -0.013946 1.171566
C  -2.192553 0.433696 -1.353271
C  0.705967 -0.61472 0.109239
C  0.840866 1.744368 -0.285276
C  2.118714 -0.708531 0.115011
C  2.248995 1.668228 -0.329951
C  2.901521 0.434978 -0.117618
H  -2.989587 2.389112 0.430855
H  -1.410525 2.685149 1.214111
H  -1.629815 2.973051 -0.546015
H  -1.667261 0.182783 2.132267
H  -3.236115 0.283009 1.285815
H  -2.172133 -1.09727 0.981399
H  -3.283033 0.614124 -1.304649
H  -1.779167 1.056498 -2.168325
H  -2.019144 -0.624871 -1.596437
H  0.377917 2.724515 -0.41536
H  2.580304 -1.684303 0.292127
H  2.832145 2.576894 -0.514367
H  3.99329 0.362349 -0.132242
