program: Orca
programVersion: 5.0.2
elementType: O O O N C C C C C C C C C C C C C C C C C C C C C C H H H H H H H H H H H H H H H H H H H H H H H
charge: 0
multiplicity: 1
keywords: wb97x-d3
keywords: def2-TZVPP
keywords: def2/J RIJCOSX
keywords: DEFGRID2
keywords: scfconv7
keywords: smallprint printgap noloewdin
keywords: NOSOSCF
formula: C22H23NO3
InChI: InChI=1/C22H23NO3/c1-21(2)19(22(21,3)4)20(24)26-18(14-23)15-9-8-12-17(13-15)25-16-10-6-5-7-11-16/h5-13,18-19H,1-4H3
49 atoms
O  0.65642 2.354805 0.301398
O  1.652913 1.529583 -1.517722
O  -2.392382 -2.670263 -0.853798
N  -2.472047 3.04151 1.106388
C  4.345396 2.437757 -0.220112
C  3.828693 3.74406 -0.729364
C  2.904058 2.83137 0.083091
C  4.674774 1.309025 -1.170269
C  5.266707 2.40921 0.980374
C  4.23315 5.034513 -0.051998
C  3.581293 3.958287 -2.203396
C  1.734581 2.166362 -0.497062
C  -0.552334 1.738222 -0.097966
C  -0.634329 0.279262 0.298069
C  -1.613025 2.482352 0.584874
C  -1.453285 -0.559775 -0.44362
C  0.03418 -0.195478 1.418491
C  -1.599696 -1.88547 -0.062318
C  -0.107657 -1.528922 1.774093
C  -0.919284 -2.382022 1.042853
C  -3.136096 -3.677134 -0.283699
C  -3.154133 -4.902164 -0.932188
C  -3.891585 -3.465874 0.86281
C  -3.941398 -5.927867 -0.426833
C  -4.664308 -4.503539 1.362726
C  -4.693734 -5.735943 0.723266
H  2.731891 3.172964 1.09755
H  4.489626 0.343605 -0.695998
H  4.132504 1.324709 -2.110551
H  5.739186 1.351579 -1.410883
H  4.980073 3.106881 1.764707
H  5.271791 1.41129 1.422315
H  6.291025 2.641285 0.681611
H  3.511962 5.821854 -0.277747
H  4.295886 4.954681 1.031043
H  5.206462 5.36627 -0.419459
H  2.820687 4.727972 -2.34669
H  4.49801 4.313001 -2.678711
H  3.256061 3.074484 -2.744582
H  -0.722066 1.845431 -1.174549
H  -1.978596 -0.186616 -1.314801
H  0.662294 0.454615 2.012001
H  0.420607 -1.912167 2.63675
H  -1.013549 -3.41987 1.334576
H  -2.561318 -5.049395 -1.825629
H  -3.885029 -2.505338 1.362113
H  -3.957572 -6.883071 -0.934377
H  -5.252633 -4.34145 2.256184
H  -5.301795 -6.538947 1.117439
elementType: O N C H
totalener: -1132.68372152 hartree
nucrepener: 2169.01543383 hartree
electener: -3301.69915535 hartree
oneelecener: -5847.08059805 hartree
twoeener: 2545.38144270 hartree
cpcmener: -0.03375904 hartree
kineticenergy: 1127.65543904 hartree
xcener: -110.659764292479 hartree
chargesum: -0.0000000
charge: -0.297769 -0.475804 -0.338245 -0.102880 0.109908 0.097242 -0.118270 -0.303118 -0.286213 -0.278433 -0.300122 0.388782 0.405035 0.028294 -0.217479 -0.249561 -0.201078 0.261195 -0.153322 -0.168961 0.268448 -0.241488 -0.178985 -0.130108 -0.152134 -0.181508 0.090185 0.102152 0.096406 0.098533 0.093244 0.095728 0.099372 0.095009 0.092005 0.099699 0.100769 0.103146 0.096319 0.144353 0.138564 0.150015 0.163824 0.160942 0.149143 0.160446 0.161380 0.162806 0.162534
qa: -0.2978 -0.4758 -0.3382 -0.1029 0.1099 0.0972 -0.1183 -0.3031 -0.2862 -0.2784 -0.3001 0.3888 0.4050 0.0283 -0.2175 -0.2496 -0.2011 0.2612 -0.1533 -0.1690 0.2684 -0.2415 -0.1790 -0.1301 -0.1521 -0.1815 0.0902 0.1022 0.0964 0.0985 0.0932 0.0957 0.0994 0.0950 0.0920 0.0997 0.1008 0.1031 0.0963 0.1444 0.1386 0.1500 0.1638 0.1609 0.1491 0.1604 0.1614 0.1628 0.1625
va: 2.1066 2.0254 2.0608 3.1129 3.6885 3.7317 3.9145 3.9047 3.9097 3.9029 3.9123 4.0885 3.7121 3.6549 4.0684 4.0970 3.9558 3.7499 3.9257 3.9022 3.6851 4.0023 3.9043 3.8823 3.8876 3.8914 1.0314 0.9995 1.0110 0.9985 1.0048 1.0023 0.9986 1.0028 1.0055 0.9990 1.0000 0.9977 1.0124 1.0227 1.0167 1.0116 0.9904 0.9941 1.0065 0.9953 0.9882 0.9892 0.9888
dispcorr: -0.023210910 hartree
energy: -1132.706932431803
dipole: 31.48821 -29.71473 1.77348 12.38375 -13.07830 -0.69455 -1.49583 2.02346 0.52763
magnitude: 1.97636 au
magnitude: 5.02351 debye
