program: Gaussian 09
title: 000074686
version: EM64L-G09RevD.01
frameworkgroup: C1[X(C13H26O)]
method: RPBEPBE
basis: SDD
operation: Freq
keyword: #pfreq=noraman
keyword: PBEPBE/SDD
title: #p freq=noraman PBEPBE/SDD
converged: YES YES NO NO
title: Mulliken charges:
elementType: O C C C C C C C C C C C C C H H H H H H H H H H H H H H H H H H H H H H H H H H
charge: -0.437203 -0.012298 -0.490633 -0.417677 -0.397223 -0.389244 -0.407187 -0.381802 -0.382918 -0.391859 -0.385893 -0.402202 -0.377862 -0.397632 0.202785 0.220743 0.209426 0.184620 0.190638 0.196631 0.196055 0.197918 0.212044 0.197520 0.195087 0.183213 0.192258 0.175567 0.202504 0.197120 0.191141 0.207490 0.207386 0.190110 0.197241 0.196376 0.185048 0.217295 0.190983 0.334434
chargesum: 0.00000
title: Mulliken charges with hydrogens summed into heavy atoms:
elementType: O C C C C C C C C C C C C C
charge: -0.102769 0.190488 -0.060464 -0.042419 -0.004537 0.020719 -0.014580 -0.006331 -0.004847 -0.003598 0.028982 -0.014851 0.003562 0.010646
polarizability: 1.57832480e+02 -1.94778211e+00 1.46400480e+02 -1.01731707e+00 3.57823989e-01 1.15791364e+02
1716.lowfreq: -15.7421 0.0004 0.0007 0.0008 7.4440 18.9321 52.6111 58.6199 94.7328
frequency: 51.6960 58.5798 94.6805 122.7955 144.9375 155.1632 159.0828 197.4578 218.9079 225.1398 249.2082 270.7613 275.3779 296.8333 316.7131 344.2370 362.0461 372.8292 405.2826 471.0303 487.4499 518.0722 539.1593 694.6109 714.6249 729.0326 766.3967 776.2447 796.3438 822.8675 825.3354 866.9393 892.3556 904.2141 916.7273 953.2629 964.7387 976.9610 990.9942 1015.4977 1024.9644 1038.3839 1054.0971 1074.7477 1092.9891 1099.6934 1112.2233 1116.0935 1128.0890 1136.4291 1151.4738 1166.9847 1180.3673 1192.8492 1230.9552 1239.1351 1246.4898 1261.9609 1270.1921 1281.5727 1287.5447 1291.9982 1298.2861 1308.3025 1313.8334 1318.1446 1337.7080 1341.2370 1345.4615 1347.1019 1349.9984 1352.2012 1358.2033 1361.7592 1371.8691 1382.0194 1458.3505 1460.4558 1463.2580 1467.4844 1468.0095 1470.4799 1475.5483 1481.0548 1482.5952 1486.7567 1492.0780 1500.9956 2943.7727 2951.0020 2953.3508 2957.0105 2960.6459 2964.8826 2966.9936 2969.7249 2972.7298 2974.6286 2976.9967 2980.9932 2982.3893 3001.2680 3006.1259 3007.1464 3012.0375 3018.8095 3019.5659 3030.3184 3033.7058 3045.2874 3062.4414 3065.9743 3072.1475 3568.5621
redmass: 3.1429 3.9834 2.5920 2.9447 2.7620 2.1582 2.7390 2.2222 2.3421 2.2715 2.4554 2.3863 1.9015 1.2742 2.4685 2.0779 2.0169 3.2735 2.4715 2.3644 2.0673 2.5058 2.3046 1.2042 1.3510 1.2983 1.9700 1.4810 1.9674 1.9343 1.8470 2.2614 1.7003 2.2209 1.8767 2.0459 1.9447 2.3739 2.0235 2.0214 2.0653 1.7425 1.9135 2.2373 2.0470 1.8540 1.3666 2.3723 1.7700 1.6839 1.8710 1.3439 1.4187 1.3795 1.3099 1.2818 1.2602 1.2383 1.2381 1.1892 1.2466 1.1730 1.1694 1.2229 1.2718 1.2965 1.3751 1.3680 1.3095 1.3803 1.4678 1.3656 1.3858 1.4938 1.3574 1.2429 1.0753 1.0840 1.0822 1.0750 1.0824 1.0862 1.0779 1.0832 1.0859 1.0867 1.0848 1.0847 1.0693 1.0609 1.0603 1.0620 1.0626 1.0675 1.0646 1.0651 1.0679 1.0707 1.0686 1.0670 1.0695 1.0991 1.0972 1.0975 1.0962 1.0975 1.0942 1.0981 1.0955 1.0939 1.0951 1.0951 1.0913 1.0659
irintensity: 0.6153 1.5625 0.7762 2.4405 0.7494 3.1459 0.2482 0.6161 0.3982 0.3870 0.6284 0.7262 0.8200 136.1190 7.8505 4.6669 1.9008 0.8426 1.7819 2.1236 3.0108 3.7827 2.6034 15.1867 9.3740 12.6440 1.3096 3.7194 0.1383 5.8293 5.6007 2.9287 11.0954 3.0587 0.7958 36.8981 1.1237 23.7721 12.3188 18.8401 0.6584 3.0524 23.6160 1.6984 0.7974 0.7420 5.9986 0.6889 6.2426 1.8420 2.3672 10.8574 1.7258 1.3364 18.2193 3.8441 2.0583 0.9089 2.6556 0.5069 3.2804 0.2782 3.3082 2.2785 0.3581 11.6652 0.4551 1.8363 0.2714 1.3695 0.1069 0.2140 0.5152 3.4095 0.1379 20.7111 1.5766 6.9418 8.7496 6.1779 7.8463 4.0385 0.3982 10.7771 2.9660 0.9472 17.6485 36.4319 25.3116 38.2402 18.8275 26.1684 20.1146 8.5768 2.2850 94.2995 27.4099 74.6536 26.8265 50.7983 23.7364 8.6452 30.1264 31.9679 53.3000 34.6140 43.3860 74.2078 166.4374 58.2780 117.5829 39.5857 36.5853 5.0912
temp: 298.150 k
press: 1.00000 atm
elementType: 8 6 6 6 6 6 6 6 6 6 6 6 6 6 1 1 1 1 1 1 1 1 1 1 1 1 1 1 1 1 1 1 1 1 1 1 1 1 1 1
symmnumber: 1
zpe: 966675.5 jmol-1
zpe.correction: 0.368187 hartree
zpe.thermalcorrener: 0.383886 hartree
zpe.thermalcorrenthalpy: 0.384830 hartree
zpe.thermalcorrgfe: 0.326369 hartree
zpe.sumelectzpe: -585.009905 hartree
zpe.sumelectthermal: -584.994207 hartree
zpe.sumelectthermalent: -584.993263 hartree
zpe.sumelectthermalfe: -585.051724 hartree
dipole: 2.1816 1.0212 -0.2203
dipole: 2.4189
quadrupole: -104.7647 -87.9846 -90.2131
quadrupole: -6.2479 0.3582 -0.1666
quadrupole: -10.4439 6.3362 4.1077 -6.2479 0.3582 -0.1666
hfenergy: -585.3780927 hartree
pointgroup: C01 [X(C13H26O1)]
dipole: 0.8661788 0.3866393 -0.0767161 debye
polarizability: 157.773086|-2.1527636|146.4695648|-0.646596|0.5315332|115.7816735 unknown
InChI: InChI=1S/C13H26O/c14-12-13-10-8-6-4-2-1-3-5-7-9-11-13/h13-14H,1-12H2
charge 0 multiplicity 1
40 atoms
O  -4.410439 -0.442539 -0.200019
C  -1.975706 -0.817821 0.363993
C  -1.738471 0.684929 0.706749
C  -0.700602 -1.546546 -0.155744
C  -1.392985 1.608119 -0.497214
C  0.449017 -1.636153 0.876995
C  -0.482744 2.818582 -0.141009
C  1.748251 -2.30631 0.345142
C  0.898031 2.445042 0.466613
C  2.517621 -1.575276 -0.793247
C  1.749435 1.492178 -0.407998
C  3.492898 -0.439185 -0.368569
C  2.879967 0.778283 0.372014
C  -3.126931 -1.00666 -0.652114
H  -2.288615 -1.317279 1.305729
H  -0.92681 0.735522 1.454428
H  -2.631838 1.078566 1.233689
H  -0.34145 -1.046905 -1.077927
H  -0.982145 -2.576356 -0.46208
H  -2.32399 2.000919 -0.955773
H  -0.901457 1.018558 -1.294331
H  0.088464 -2.221776 1.748508
H  0.68209 -0.628421 1.262904
H  -1.015733 3.478209 0.574527
H  -0.325872 3.418655 -1.060966
H  1.479499 -3.321639 -0.014851
H  2.443347 -2.459401 1.197066
H  0.743136 1.971002 1.457079
H  1.463504 3.376915 0.669778
H  1.800492 -1.196109 -1.547403
H  3.127496 -2.331718 -1.328121
H  2.175345 2.045148 -1.27024
H  1.086577 0.722005 -0.838584
H  4.007941 -0.07708 -1.28329
H  4.28291 -0.878901 0.275302
H  3.690112 1.500458 0.602319
H  2.486109 0.446277 1.353319
H  -3.340222 -2.081265 -0.785898
H  -2.841225 -0.585623 -1.641024
H  -4.324408 0.542298 -0.145955
