program: Orca
programVersion: 5.0.2
elementType: O O O N C C C C C C C C C C C C C C C C C C C C C C H H H H H H H H H H H H H H H H H H H H H H H
charge: 0
multiplicity: 1
keywords: wb97x-d3
keywords: def2-TZVPP
keywords: def2/J RIJCOSX
keywords: DEFGRID2
keywords: scfconv7
keywords: smallprint printgap noloewdin
keywords: NOSOSCF
formula: C22H23NO3
InChI: InChI=1/C22H23NO3/c1-21(2)19(22(21,3)4)20(24)26-18(14-23)15-9-8-12-17(13-15)25-16-10-6-5-7-11-16/h5-13,18-19H,1-4H3
49 atoms
O  0.284526 2.733166 -0.058526
O  1.451759 1.27751 -1.281103
O  -2.756295 -2.340007 -0.707464
N  -2.831632 3.803976 0.040911
C  3.813396 2.152193 0.644119
C  3.947278 3.03787 -0.551863
C  2.58083 2.890132 0.113021
C  3.928837 0.650918 0.517638
C  4.310593 2.618731 1.994611
C  4.587649 4.402432 -0.413735
C  4.214751 2.459409 -1.922547
C  1.446179 2.196105 -0.498607
C  -0.909181 2.120455 -0.513974
C  -1.199626 0.802979 0.170537
C  -1.973018 3.076406 -0.1972
C  -1.783293 -0.217191 -0.564004
C  -0.928067 0.633281 1.522643
C  -2.120963 -1.408752 0.064142
C  -1.258549 -0.567628 2.131125
C  -1.863981 -1.591419 1.416692
C  -2.60703 -3.681905 -0.44934
C  -3.750518 -4.464709 -0.494879
C  -1.360985 -4.25225 -0.22205
C  -3.643928 -5.837207 -0.317084
C  -1.271725 -5.623871 -0.032206
C  -2.407672 -6.421443 -0.080468
H  2.279629 3.738994 0.716478
H  4.969346 0.358864 0.673618
H  3.333201 0.159799 1.289876
H  3.620138 0.245401 -0.441267
H  4.140473 3.677512 2.177965
H  3.808141 2.066694 2.791035
H  5.382177 2.430968 2.090547
H  4.309156 4.922426 0.500642
H  5.676062 4.316406 -0.432546
H  4.294738 5.039251 -1.250263
H  3.835018 1.455107 -2.081829
H  3.78308 3.100348 -2.69377
H  5.293267 2.429177 -2.091179
H  -0.903123 1.988103 -1.601702
H  -1.985989 -0.087558 -1.620281
H  -0.472296 1.423945 2.1037
H  -1.056706 -0.708188 3.184531
H  -2.132437 -2.51198 1.918109
H  -4.71353 -4.00488 -0.67539
H  -0.467185 -3.641936 -0.198028
H  -4.535653 -6.448364 -0.357189
H  -0.302485 -6.070825 0.146105
H  -2.328434 -7.49059 0.06303
elementType: O N C H
totalener: -1132.68413833 hartree
nucrepener: 2192.75622310 hartree
electener: -3325.44036144 hartree
oneelecener: -5894.57414871 hartree
twoeener: 2569.13378728 hartree
cpcmener: -0.03390991 hartree
kineticenergy: 1127.64651885 hartree
xcener: -110.658188477792 hartree
chargesum: -0.0000000
charge: -0.294991 -0.475738 -0.336053 -0.102681 0.097835 0.104569 -0.109381 -0.298961 -0.282793 -0.283287 -0.305459 0.382029 0.417140 0.022795 -0.222080 -0.246553 -0.218164 0.278680 -0.146863 -0.180284 0.283311 -0.247226 -0.194697 -0.127617 -0.147490 -0.183328 0.088505 0.102178 0.099730 0.097665 0.093112 0.095681 0.100069 0.094059 0.099847 0.095496 0.097129 0.102629 0.099067 0.143683 0.136530 0.150499 0.163234 0.160681 0.149562 0.161041 0.161519 0.163621 0.161746
qa: -0.2950 -0.4757 -0.3361 -0.1027 0.0978 0.1046 -0.1094 -0.2990 -0.2828 -0.2833 -0.3055 0.3820 0.4171 0.0228 -0.2221 -0.2466 -0.2182 0.2787 -0.1469 -0.1803 0.2833 -0.2472 -0.1947 -0.1276 -0.1475 -0.1833 0.0885 0.1022 0.0997 0.0977 0.0931 0.0957 0.1001 0.0941 0.0998 0.0955 0.0971 0.1026 0.0991 0.1437 0.1365 0.1505 0.1632 0.1607 0.1496 0.1610 0.1615 0.1636 0.1617
va: 2.1112 2.0248 2.0668 3.1121 3.7133 3.7072 3.9108 3.9108 3.9053 3.9042 3.9057 4.1002 3.7065 3.6254 4.0811 4.0908 3.9578 3.7453 3.9206 3.9068 3.6719 4.0077 3.9169 3.8792 3.8841 3.8961 1.0331 0.9986 0.9998 1.0115 1.0051 1.0023 0.9989 1.0050 0.9988 1.0022 1.0126 0.9988 0.9981 1.0197 1.0179 1.0122 0.9898 0.9944 1.0067 0.9954 0.9882 0.9888 0.9892
dispcorr: -0.023503593 hartree
energy: -1132.707641927762
dipole: 33.50904 -31.43968 2.06936 5.91135 -6.95798 -1.04663 3.92842 -3.07372 0.85471
magnitude: 2.47148 au
magnitude: 6.28200 debye
