program: Orca
programVersion: 5.0.2
elementType: O O O N C C C C C C C C C C C C C C C C C C C C C C H H H H H H H H H H H H H H H H H H H H H H H
charge: 0
multiplicity: 1
keywords: wb97x-d3
keywords: def2-TZVPP
keywords: def2/J RIJCOSX
keywords: DEFGRID2
keywords: scfconv7
keywords: smallprint printgap noloewdin
keywords: NOSOSCF
formula: C22H23NO3
InChI: InChI=1/C22H23NO3/c1-21(2)19(22(21,3)4)20(24)26-18(14-23)15-9-8-12-17(13-15)25-16-10-6-5-7-11-16/h5-13,18-19H,1-4H3
49 atoms
O  0.373919 2.348727 0.773212
O  1.653248 0.609819 0.219147
O  -3.209756 -2.334716 -0.687726
N  0.128525 -0.132551 3.084799
C  3.917303 2.692316 -0.353159
C  3.071552 2.820649 -1.578446
C  2.410565 2.862593 -0.194972
C  4.607616 1.391176 -0.012655
C  4.742594 3.871567 0.117179
C  3.045896 4.118806 -2.354798
C  2.839373 1.640871 -2.493178
C  1.507183 1.806694 0.259779
C  -0.650912 1.454921 1.154518
C  -1.269018 0.703319 -0.011091
C  -0.185442 0.550861 2.214492
C  -1.916616 -0.504089 0.213966
C  -1.25115 1.261857 -1.283334
C  -2.521964 -1.164904 -0.846918
C  -1.865567 0.590267 -2.330169
C  -2.496169 -0.625523 -2.124978
C  -2.835217 -3.24921 0.267612
C  -1.506606 -3.598609 0.475954
C  -3.853394 -3.868773 0.977186
C  -1.204715 -4.571571 1.418047
C  -3.53681 -4.850375 1.905979
C  -2.213744 -5.200948 2.135462
H  2.093966 3.852496 0.113968
H  5.620483 1.412364 -0.41956
H  4.696534 1.278691 1.069209
H  4.12452 0.499296 -0.397517
H  5.002555 3.748854 1.170148
H  5.675428 3.933438 -0.446695
H  4.230694 4.826967 0.021208
H  3.890963 4.16354 -3.044933
H  2.133177 4.183305 -2.949794
H  3.083619 5.003689 -1.723225
H  2.868373 0.670279 -2.007977
H  1.869455 1.73283 -2.986032
H  3.602154 1.635409 -3.274321
H  -1.41495 2.090902 1.610921
H  -1.954718 -0.930074 1.209175
H  -0.767866 2.21039 -1.475421
H  -1.846437 1.019014 -3.323069
H  -2.967956 -1.150956 -2.945122
H  -0.711999 -3.124655 -0.086307
H  -4.884012 -3.589403 0.799035
H  -0.170415 -4.842503 1.584447
H  -4.331961 -5.335973 2.456272
H  -1.970185 -5.961459 2.865064
elementType: O N C H
totalener: -1132.68279256 hartree
nucrepener: 2252.33497882 hartree
electener: -3385.01777138 hartree
oneelecener: -6014.48451341 hartree
twoeener: 2629.46674203 hartree
cpcmener: -0.03668536 hartree
kineticenergy: 1127.64638185 hartree
xcener: -110.662906806163 hartree
chargesum: -0.0000000
charge: -0.302213 -0.468754 -0.336448 -0.098557 0.102889 0.096379 -0.086688 -0.302577 -0.284998 -0.279789 -0.300922 0.365925 0.512140 -0.014231 -0.245907 -0.215952 -0.282154 0.294642 -0.093889 -0.255704 0.295271 -0.202425 -0.255043 -0.142098 -0.122008 -0.189105 0.088868 0.098691 0.102210 0.096254 0.096219 0.099960 0.093267 0.100460 0.095273 0.093152 0.100090 0.096300 0.105435 0.151430 0.138583 0.152085 0.160941 0.148710 0.159763 0.148811 0.163188 0.161102 0.161421
qa: -0.3022 -0.4688 -0.3364 -0.0986 0.1029 0.0964 -0.0867 -0.3026 -0.2850 -0.2798 -0.3009 0.3659 0.5121 -0.0142 -0.2459 -0.2160 -0.2822 0.2946 -0.0939 -0.2557 0.2953 -0.2024 -0.2550 -0.1421 -0.1220 -0.1891 0.0889 0.0987 0.1022 0.0963 0.0962 0.1000 0.0933 0.1005 0.0953 0.0932 0.1001 0.0963 0.1054 0.1514 0.1386 0.1521 0.1609 0.1487 0.1598 0.1488 0.1632 0.1611 0.1614
va: 2.1233 2.0236 2.0722 3.1011 3.7355 3.7139 3.9029 3.9040 3.9040 3.9005 3.9072 4.0806 3.7963 3.7201 4.1133 3.9508 3.9795 3.7487 3.8842 4.0277 3.6662 3.9124 4.0131 3.8793 3.8757 3.9018 1.0339 0.9984 0.9991 1.0121 1.0019 0.9989 1.0054 0.9989 1.0026 1.0054 1.0111 1.0021 0.9995 0.9877 1.0151 1.0081 0.9889 1.0059 0.9970 1.0072 0.9888 0.9882 0.9894
dispcorr: -0.024961519 hartree
energy: -1132.707754081148
dipole: 26.31854 -26.24475 0.07379 16.06871 -13.94863 2.12008 -11.80555 10.30947 -1.49608
magnitude: 2.59585 au
magnitude: 6.59813 debye
