program: Orca
programVersion: 5.0.2
elementType: O O O N C C C C C C C C C C C C C C C C C C C C C C H H H H H H H H H H H H H H H H H H H H H H H
charge: 0
multiplicity: 1
keywords: wb97x-d3
keywords: def2-TZVPP
keywords: def2/J RIJCOSX
keywords: DEFGRID2
keywords: scfconv7
keywords: smallprint printgap noloewdin
keywords: NOSOSCF
formula: C22H23NO3
InChI: InChI=1/C22H23NO3/c1-21(2)19(22(21,3)4)20(24)26-18(14-23)15-9-8-12-17(13-15)25-16-10-6-5-7-11-16/h5-13,18-19H,1-4H3
49 atoms
O  0.041787 2.384466 -0.077325
O  0.979936 0.608131 -1.057892
O  -2.834934 -2.422983 -0.099697
N  -2.362406 4.428343 -1.079174
C  3.115627 0.802826 1.210621
C  3.654215 1.730419 0.171624
C  2.191503 1.860471 0.601261
C  2.911968 -0.666572 0.918444
C  3.470796 1.014065 2.666587
C  4.549086 2.881223 0.581208
C  4.015908 1.232464 -1.208314
C  1.063535 1.517422 -0.268065
C  -1.16625 2.124195 -0.789123
C  -2.026041 1.143838 -0.031436
C  -1.82396 3.422123 -0.937866
C  -2.07551 -0.172269 -0.464987
C  -2.691362 1.528932 1.128338
C  -2.765374 -1.111346 0.289466
C  -3.408038 0.587365 1.848146
C  -3.437838 -0.739727 1.442276
C  -1.686372 -3.068806 -0.48943
C  -1.827691 -4.066069 -1.444421
C  -0.443012 -2.789414 0.066957
C  -0.71518 -4.793445 -1.841797
C  0.661643 -3.520521 -0.347898
C  0.534315 -4.522012 -1.301013
H  1.989672 2.706999 1.247563
H  2.067998 -1.053128 1.493497
H  2.737955 -0.907881 -0.124717
H  3.798981 -1.218827 1.235232
H  2.748113 0.50535 3.307075
H  4.45441 0.591511 2.881915
H  3.485195 2.060712 2.963047
H  4.239387 3.362577 1.506376
H  5.577254 2.537117 0.711157
H  4.555302 3.646897 -0.196549
H  3.449755 0.371959 -1.549629
H  3.882923 2.027856 -1.94378
H  5.070986 0.951864 -1.221754
H  -0.961305 1.75277 -1.797444
H  -1.571256 -0.464017 -1.377628
H  -2.658486 2.556232 1.469847
H  -3.935902 0.882241 2.744888
H  -3.980581 -1.479626 2.016213
H  -2.802134 -4.272693 -1.868462
H  -0.323815 -2.020067 0.819505
H  -0.829091 -5.571111 -2.585514
H  1.629155 -3.304257 0.086705
H  1.400566 -5.087173 -1.617364
elementType: O N C H
totalener: -1132.68420312 hartree
nucrepener: 2292.80840299 hartree
electener: -3425.49260611 hartree
oneelecener: -6094.54141163 hartree
twoeener: 2669.04880552 hartree
cpcmener: -0.03212952 hartree
kineticenergy: 1127.65011725 hartree
xcener: -110.658879857492 hartree
chargesum: 0.0000000
charge: -0.289666 -0.484239 -0.341912 -0.103817 0.126175 0.098739 -0.116863 -0.340327 -0.282874 -0.286817 -0.299569 0.406971 0.420195 -0.002390 -0.215311 -0.174370 -0.208201 0.258771 -0.133684 -0.218455 0.303523 -0.260527 -0.210565 -0.117913 -0.145241 -0.203809 0.088184 0.105766 0.096409 0.105102 0.095976 0.100032 0.093327 0.093831 0.100196 0.096024 0.097031 0.101730 0.099205 0.134601 0.148860 0.144891 0.163688 0.150754 0.148775 0.160849 0.160813 0.175070 0.161061
qa: -0.2897 -0.4842 -0.3419 -0.1038 0.1262 0.0987 -0.1169 -0.3403 -0.2829 -0.2868 -0.2996 0.4070 0.4202 -0.0024 -0.2153 -0.1744 -0.2082 0.2588 -0.1337 -0.2185 0.3035 -0.2605 -0.2106 -0.1179 -0.1452 -0.2038 0.0882 0.1058 0.0964 0.1051 0.0960 0.1000 0.0933 0.0938 0.1002 0.0960 0.0970 0.1017 0.0992 0.1346 0.1489 0.1449 0.1637 0.1508 0.1488 0.1608 0.1608 0.1751 0.1611
va: 2.1250 2.0096 2.0685 3.1093 3.6764 3.7043 3.9185 3.9196 3.9047 3.9055 3.9095 4.0844 3.7219 3.6312 4.0635 3.9270 3.9893 3.7349 3.9054 4.0280 3.6915 4.0031 3.8932 3.8829 3.8674 3.9369 1.0324 0.9920 1.0007 1.0007 1.0019 0.9989 1.0057 1.0049 0.9987 1.0022 1.0120 0.9990 0.9980 1.0211 1.0157 1.0079 0.9884 1.0032 1.0075 0.9936 0.9873 0.9816 0.9912
dispcorr: -0.026011657 hartree
energy: -1132.710214780755
dipole: 32.03989 -30.30386 1.73603 -1.45144 0.45679 -0.99465 7.97730 -6.82761 1.14969
magnitude: 2.30758 au
magnitude: 5.86540 debye
