program: Orca
programVersion: 5.0.2
elementType: O O O N C C C C C C C C C C C C C C C C C C C C C C H H H H H H H H H H H H H H H H H H H H H H H
charge: 0
multiplicity: 1
keywords: wb97x-d3
keywords: def2-TZVPP
keywords: def2/J RIJCOSX
keywords: DEFGRID2
keywords: scfconv7
keywords: smallprint printgap noloewdin
keywords: NOSOSCF
formula: C22H23NO3
InChI: InChI=1/C22H23NO3/c1-21(2)19(22(21,3)4)20(24)26-18(14-23)15-9-8-12-17(13-15)25-16-10-6-5-7-11-16/h5-13,18-19H,1-4H3
49 atoms
O  0.223175 2.51488 0.614029
O  1.286366 0.566534 0.414336
O  -2.997666 -2.319344 -0.75479
N  -0.533224 0.511171 3.249229
C  3.847432 2.259932 -0.211559
C  3.143362 2.265161 -1.528357
C  2.364698 2.618703 -0.254966
C  4.328199 0.967246 0.406703
C  4.772564 3.4021 0.151164
C  3.355473 3.405708 -2.498924
C  2.860578 0.976368 -2.263302
C  1.298855 1.764933 0.271069
C  -0.943121 1.822583 1.023569
C  -1.546892 0.982615 -0.084658
C  -0.688721 1.062809 2.251992
C  -1.981154 -0.315278 0.140416
C  -1.682595 1.560213 -1.342469
C  -2.526216 -1.045757 -0.908773
C  -2.240799 0.822679 -2.374756
C  -2.656502 -0.483645 -2.170279
C  -2.458696 -3.168299 0.181817
C  -1.088458 -3.275043 0.389736
C  -3.347396 -3.977193 0.875696
C  -0.616406 -4.195154 1.314982
C  -2.859235 -4.903942 1.786337
C  -1.494243 -5.012263 2.015733
H  2.151619 3.676454 -0.147603
H  4.32407 1.041484 1.495929
H  3.75603 0.085966 0.134206
H  5.361543 0.79116 0.098604
H  4.400825 4.377526 -0.156013
H  4.917482 3.43731 1.232441
H  5.753111 3.257957 -0.306868
H  4.262178 3.240552 -3.084701
H  2.519609 3.464532 -3.198285
H  3.443397 4.376876 -2.016356
H  1.978395 1.090106 -2.896534
H  3.702248 0.74282 -2.918735
H  2.696626 0.112401 -1.626731
H  -1.645928 2.613504 1.297094
H  -1.892898 -0.763393 1.121997
H  -1.35714 2.576123 -1.523727
H  -2.346907 1.267067 -3.355247
H  -3.082719 -1.061929 -2.980048
H  -0.390602 -2.65261 -0.156552
H  -4.411897 -3.886502 0.698021
H  0.449963 -4.27485 1.482056
H  -3.553919 -5.538129 2.321864
H  -1.116316 -5.729923 2.731489
elementType: O N C H
totalener: -1132.68285979 hartree
nucrepener: 2272.20098115 hartree
electener: -3404.88384094 hartree
oneelecener: -6054.37813878 hartree
twoeener: 2649.49429784 hartree
cpcmener: -0.03546532 hartree
kineticenergy: 1127.63933490 hartree
xcener: -110.660830705440 hartree
chargesum: -0.0000000
charge: -0.302041 -0.476545 -0.334660 -0.093489 0.108789 0.096582 -0.099943 -0.305927 -0.284528 -0.281623 -0.300476 0.394529 0.538692 -0.038300 -0.261052 -0.206360 -0.292430 0.309427 -0.097440 -0.256297 0.306073 -0.212685 -0.257984 -0.140562 -0.120856 -0.189937 0.087949 0.102266 0.096452 0.099616 0.093275 0.095867 0.100095 0.099734 0.095748 0.093226 0.097632 0.103900 0.098981 0.147518 0.136681 0.145845 0.161570 0.149274 0.159764 0.148211 0.162961 0.161366 0.161109
qa: -0.3020 -0.4765 -0.3347 -0.0935 0.1088 0.0966 -0.0999 -0.3059 -0.2845 -0.2816 -0.3005 0.3945 0.5387 -0.0383 -0.2611 -0.2064 -0.2924 0.3094 -0.0974 -0.2563 0.3061 -0.2127 -0.2580 -0.1406 -0.1209 -0.1899 0.0879 0.1023 0.0965 0.0996 0.0933 0.0959 0.1001 0.0997 0.0957 0.0932 0.0976 0.1039 0.0990 0.1475 0.1367 0.1458 0.1616 0.1493 0.1598 0.1482 0.1630 0.1614 0.1611
va: 2.1221 2.0177 2.0774 3.1032 3.7104 3.7137 3.9289 3.9051 3.9035 3.9021 3.9134 4.0544 3.7827 3.7236 4.1192 3.8907 3.9925 3.7546 3.8812 4.0188 3.6599 3.9127 4.0136 3.8777 3.8730 3.9045 1.0334 0.9991 1.0128 0.9983 1.0052 1.0022 0.9986 0.9991 1.0024 1.0052 1.0012 0.9986 1.0101 0.9884 1.0164 1.0112 0.9881 1.0061 0.9986 1.0077 0.9890 0.9880 0.9896
dispcorr: -0.024909491 hartree
energy: -1132.707769280725
dipole: 28.23182 -27.72472 0.50710 11.37276 -9.51650 1.85626 -11.25665 9.41784 -1.83881
magnitude: 2.66159 au
magnitude: 6.76522 debye
