program: Orca
programVersion: 5.0.2
elementType: O O O N C C C C C C C C C C C C C C C C C C C C C C H H H H H H H H H H H H H H H H H H H H H H H
charge: 0
multiplicity: 1
keywords: wb97x-d3
keywords: def2-TZVPP
keywords: def2/J RIJCOSX
keywords: DEFGRID2
keywords: scfconv7
keywords: smallprint printgap noloewdin
keywords: NOSOSCF
formula: C22H23NO3
InChI: InChI=1/C22H23NO3/c1-21(2)19(22(21,3)4)20(24)26-18(14-23)15-9-8-12-17(13-15)25-16-10-6-5-7-11-16/h5-13,18-19H,1-4H3
49 atoms
O  0.199983 2.639102 0.511268
O  0.693628 2.051337 -1.583454
O  -1.738532 -1.943046 1.339622
N  -2.36198 3.910032 2.139497
C  3.217575 0.77507 -0.131271
C  3.691066 2.084237 -0.676515
C  2.396769 2.044771 0.125541
C  2.687703 -0.304708 -1.046084
C  3.884897 0.172624 1.085434
C  4.839453 2.805314 -0.002821
C  3.689505 2.357297 -2.163268
C  1.061992 2.230621 -0.448455
C  -1.164227 2.731993 0.136745
C  -1.801539 1.38166 -0.102533
C  -1.819877 3.396619 1.264509
C  -1.473138 0.307862 0.715666
C  -2.709525 1.22697 -1.138177
C  -2.061777 -0.92389 0.483352
C  -3.30144 -0.011181 -1.348335
C  -2.981999 -1.093509 -0.545221
C  -1.476203 -3.189859 0.823326
C  -0.712911 -3.36147 -0.325221
C  -1.958724 -4.283221 1.527257
C  -0.444594 -4.647544 -0.771611
C  -1.6716 -5.563697 1.075127
C  -0.921727 -5.752124 -0.077735
H  2.477473 2.424463 1.13809
H  3.510358 -0.954668 -1.350476
H  1.962469 -0.926072 -0.515824
H  2.208401 0.055002 -1.951296
H  4.171137 0.909242 1.832866
H  3.211842 -0.536742 1.57019
H  4.783833 -0.374395 0.794044
H  5.795092 2.386587 -0.324363
H  4.83322 3.860562 -0.281911
H  4.804125 2.760202 1.083762
H  3.532525 3.420386 -2.354036
H  4.667746 2.097057 -2.572436
H  2.945932 1.80762 -2.730731
H  -1.297514 3.370757 -0.742506
H  -0.763285 0.414184 1.527157
H  -2.953138 2.064932 -1.778606
H  -4.015599 -0.137437 -2.150776
H  -3.448157 -2.055202 -0.717926
H  -0.324083 -2.507187 -0.865936
H  -2.549458 -4.133249 2.422042
H  0.147848 -4.783121 -1.666959
H  -2.046847 -6.416807 1.624918
H  -0.707938 -6.751735 -0.431648
elementType: O N C H
totalener: -1132.68375173 hartree
nucrepener: 2261.28707181 hartree
electener: -3393.97082354 hartree
oneelecener: -6031.55600161 hartree
twoeener: 2637.58517807 hartree
cpcmener: -0.03404021 hartree
kineticenergy: 1127.65295124 hartree
xcener: -110.659043774390 hartree
chargesum: -0.0000000
charge: -0.293517 -0.470553 -0.341254 -0.102736 0.100042 0.111254 -0.103659 -0.300300 -0.282553 -0.285585 -0.304451 0.366218 0.422796 0.004386 -0.222405 -0.225416 -0.196659 0.218804 -0.134446 -0.157152 0.264254 -0.167366 -0.234380 -0.169874 -0.134377 -0.177757 0.088967 0.105127 0.093706 0.098527 0.093172 0.096349 0.100632 0.100081 0.095629 0.093138 0.102366 0.098047 0.095997 0.146039 0.137206 0.150378 0.164136 0.162908 0.159576 0.148910 0.162326 0.161517 0.161952
qa: -0.2935 -0.4706 -0.3413 -0.1027 0.1000 0.1113 -0.1037 -0.3003 -0.2826 -0.2856 -0.3045 0.3662 0.4228 0.0044 -0.2224 -0.2254 -0.1967 0.2188 -0.1344 -0.1572 0.2643 -0.1674 -0.2344 -0.1699 -0.1344 -0.1778 0.0890 0.1051 0.0937 0.0985 0.0932 0.0963 0.1006 0.1001 0.0956 0.0931 0.1024 0.0980 0.0960 0.1460 0.1372 0.1504 0.1641 0.1629 0.1596 0.1489 0.1623 0.1615 0.1620
va: 2.1094 2.0283 2.0534 3.1109 3.7144 3.7124 3.9040 3.9176 3.9037 3.9042 3.9025 4.1201 3.7071 3.6209 4.0861 4.0295 3.9779 3.7890 3.8966 3.9034 3.6853 3.8702 3.9942 3.9115 3.8893 3.8882 1.0325 0.9996 0.9974 1.0120 1.0051 1.0021 0.9990 0.9988 1.0023 1.0050 0.9989 0.9983 1.0123 1.0155 1.0277 1.0008 0.9890 0.9925 0.9947 1.0066 0.9900 0.9879 0.9887
dispcorr: -0.024947880 hartree
energy: -1132.708699612015
dipole: 29.24012 -27.84512 1.39501 -3.89437 2.53797 -1.35639 -8.35258 7.09839 -1.25419
magnitude: 2.31491 au
magnitude: 5.88405 debye
