program: Orca
programVersion: 5.0.2
elementType: O O O N C C C C C C C C C C C C C C C C C C C C C C H H H H H H H H H H H H H H H H H H H H H H H
charge: 0
multiplicity: 1
keywords: wb97x-d3
keywords: def2-TZVPP
keywords: def2/J RIJCOSX
keywords: DEFGRID2
keywords: scfconv7
keywords: smallprint printgap noloewdin
keywords: NOSOSCF
formula: C22H23NO3
InChI: InChI=1/C22H23NO3/c1-21(2)19(22(21,3)4)20(24)26-18(14-23)15-9-8-12-17(13-15)25-16-10-6-5-7-11-16/h5-13,18-19H,1-4H3
49 atoms
O  0.027584 2.606854 0.494256
O  0.893704 0.563529 0.707225
O  -2.820127 -2.273363 -0.851195
N  -1.232999 1.077466 3.262542
C  3.669067 1.912515 0.190221
C  3.1374 1.765888 -1.198203
C  2.248123 2.38216 -0.112113
C  3.930878 0.698878 1.052847
C  4.653215 3.017693 0.5089
C  3.583308 2.716351 -2.287736
C  2.822309 0.402361 -1.767781
C  1.044782 1.719198 0.392626
C  -1.250446 2.102337 0.856355
C  -1.828811 1.194065 -0.206231
C  -1.216928 1.498779 2.192563
C  -2.07557 -0.150754 0.022319
C  -2.082113 1.752548 -1.454951
C  -2.543392 -0.943931 -1.017178
C  -2.569841 0.95266 -2.475779
C  -2.792307 -0.400146 -2.268114
C  -2.032391 -3.057337 -0.044256
C  -2.674322 -4.072123 0.65165
C  -0.653808 -2.900544 0.039776
C  -1.929112 -4.937295 1.439558
C  0.0757 -3.765469 0.84351
C  -0.553499 -4.785633 1.544547
H  2.135168 3.457491 -0.193074
H  4.966293 0.382216 0.913284
H  3.809107 0.949533 2.108046
H  3.300237 -0.15858 0.844186
H  4.648367 3.225205 1.580446
H  5.667081 2.716344 0.237759
H  4.435651 3.953373 -0.00208
H  2.853282 2.727068 -3.098958
H  3.70297 3.742614 -1.947153
H  4.536416 2.390822 -2.709637
H  3.711765 0.004288 -2.260278
H  2.498637 -0.335476 -1.03989
H  2.040161 0.481477 -2.525169
H  -1.875871 2.994275 0.942823
H  -1.896966 -0.58654 0.997368
H  -1.899798 2.804986 -1.631261
H  -2.771116 1.38235 -3.447765
H  -3.16075 -1.029308 -3.068074
H  -3.748135 -4.184396 0.572807
H  -0.14469 -2.118298 -0.508801
H  -2.43228 -5.728915 1.978875
H  1.148145 -3.639933 0.91371
H  0.023972 -5.456719 2.165983
elementType: O N C H
totalener: -1132.68278465 hartree
nucrepener: 2299.80223376 hartree
electener: -3432.48501841 hartree
oneelecener: -6109.57030751 hartree
twoeener: 2677.08528910 hartree
cpcmener: -0.03516121 hartree
kineticenergy: 1127.65383220 hartree
xcener: -110.662620601287 hartree
chargesum: -0.0000000
charge: -0.296826 -0.480645 -0.336605 -0.094263 0.106826 0.095270 -0.118779 -0.304494 -0.284119 -0.282522 -0.293571 0.417803 0.490849 -0.012224 -0.251315 -0.199506 -0.266304 0.285842 -0.107716 -0.247079 0.308110 -0.259592 -0.207353 -0.121357 -0.149252 -0.189775 0.087977 0.099575 0.102057 0.097448 0.095954 0.099153 0.093399 0.095505 0.093605 0.100351 0.103922 0.089617 0.100451 0.147517 0.140685 0.146989 0.163061 0.150160 0.147615 0.159717 0.161101 0.162025 0.160715
qa: -0.2968 -0.4806 -0.3366 -0.0943 0.1068 0.0953 -0.1188 -0.3045 -0.2841 -0.2825 -0.2936 0.4178 0.4908 -0.0122 -0.2513 -0.1995 -0.2663 0.2858 -0.1077 -0.2471 0.3081 -0.2596 -0.2074 -0.1214 -0.1493 -0.1898 0.0880 0.0996 0.1021 0.0974 0.0960 0.0992 0.0934 0.0955 0.0936 0.1004 0.1039 0.0896 0.1005 0.1475 0.1407 0.1470 0.1631 0.1502 0.1476 0.1597 0.1611 0.1620 0.1607
va: 2.1261 2.0171 2.0782 3.1050 3.7003 3.7173 3.9405 3.9073 3.9022 3.9021 3.9200 4.0482 3.8279 3.6531 4.0885 3.8904 3.9935 3.7681 3.8806 4.0215 3.6737 4.0066 3.8947 3.8761 3.8900 3.9056 1.0326 0.9984 0.9993 1.0112 1.0021 0.9991 1.0052 1.0026 1.0052 0.9986 0.9989 1.0075 1.0002 0.9913 1.0147 1.0073 0.9875 1.0049 1.0081 0.9956 0.9879 0.9899 0.9895
dispcorr: -0.025505836 hartree
energy: -1132.708290486069
dipole: 29.82808 -28.86856 0.95952 7.33449 -5.72180 1.61269 -8.88647 6.74508 -2.14139
magnitude: 2.84728 au
magnitude: 7.23721 debye
