program: Orca
programVersion: 5.0.2
elementType: O O O N C C C C C C C C C C C C C C C C C C C C C C H H H H H H H H H H H H H H H H H H H H H H H
charge: 0
multiplicity: 1
keywords: wb97x-d3
keywords: def2-TZVPP
keywords: def2/J RIJCOSX
keywords: DEFGRID2
keywords: scfconv7
keywords: smallprint printgap noloewdin
keywords: NOSOSCF
formula: C22H23NO3
InChI: InChI=1/C22H23NO3/c1-21(2)19(22(21,3)4)20(24)26-18(14-23)15-9-8-12-17(13-15)25-16-10-6-5-7-11-16/h5-13,18-19H,1-4H3
49 atoms
O  0.167138 2.663124 0.586184
O  0.684972 2.161346 -1.526081
O  -1.537134 -2.01377 1.19281
N  -2.422594 3.849569 2.233426
C  3.147768 0.792456 -0.039034
C  3.670433 2.08343 -0.584502
C  2.368179 2.091634 0.201492
C  2.58697 -0.269902 -0.955876
C  3.778009 0.171533 1.187407
C  4.833178 2.768139 0.102661
C  3.699721 2.348788 -2.072469
C  1.040911 2.298553 -0.381454
C  -1.19648 2.734972 0.211506
C  -1.806361 1.376017 -0.054456
C  -1.868041 3.36334 1.350767
C  -1.384282 0.269693 0.671614
C  -2.794336 1.250731 -1.019127
C  -1.960111 -0.965486 0.420331
C  -3.372156 0.009412 -1.247002
C  -2.962141 -1.105251 -0.533402
C  -1.342749 -3.247005 0.618898
C  -1.710251 -4.355484 1.368198
C  -0.750513 -3.394872 -0.62985
C  -1.484079 -5.626749 0.859242
C  -0.542128 -4.672294 -1.130554
C  -0.906504 -5.791358 -0.392728
H  2.448505 2.470991 1.214239
H  2.139351 0.104492 -1.871217
H  3.38505 -0.95734 -1.242765
H  1.826015 -0.855954 -0.434972
H  3.073571 -0.510915 1.666573
H  4.659809 -0.409486 0.90959
H  4.08113 0.900777 1.935435
H  5.778252 2.310786 -0.196262
H  4.871491 3.819824 -0.187198
H  4.775858 2.736651 1.188848
H  3.564935 3.413313 -2.272248
H  4.680855 2.069791 -2.462436
H  2.95739 1.807982 -2.650385
H  -1.343794 3.387706 -0.655073
H  -0.613139 0.350987 1.428208
H  -3.111184 2.114292 -1.589942
H  -4.148679 -0.094075 -1.992783
H  -3.42071 -2.067921 -0.72008
H  -2.165816 -4.22349 2.341811
H  -0.449836 -2.530494 -1.209216
H  -1.770031 -6.490936 1.444665
H  -0.084197 -4.789247 -2.104198
H  -0.738948 -6.783606 -0.789828
elementType: O N C H
totalener: -1132.68372471 hartree
nucrepener: 2264.64932843 hartree
electener: -3397.33305314 hartree
oneelecener: -6038.24573247 hartree
twoeener: 2640.91267934 hartree
cpcmener: -0.03401328 hartree
kineticenergy: 1127.64568325 hartree
xcener: -110.658322070862 hartree
chargesum: 0.0000000
charge: -0.293044 -0.468579 -0.340172 -0.102663 0.103428 0.112192 -0.102516 -0.300970 -0.282453 -0.287582 -0.304399 0.360227 0.418261 0.015427 -0.223545 -0.235135 -0.203803 0.236789 -0.130744 -0.168694 0.290062 -0.246957 -0.186713 -0.127902 -0.163507 -0.184569 0.089008 0.098906 0.106153 0.093309 0.096284 0.100602 0.092878 0.100541 0.095743 0.093259 0.102338 0.097287 0.096005 0.147129 0.137933 0.149904 0.164098 0.162106 0.148656 0.158903 0.161585 0.162706 0.162227
qa: -0.2930 -0.4686 -0.3402 -0.1027 0.1034 0.1122 -0.1025 -0.3010 -0.2825 -0.2876 -0.3044 0.3602 0.4183 0.0154 -0.2235 -0.2351 -0.2038 0.2368 -0.1307 -0.1687 0.2901 -0.2470 -0.1867 -0.1279 -0.1635 -0.1846 0.0890 0.0989 0.1062 0.0933 0.0963 0.1006 0.0929 0.1005 0.0957 0.0933 0.1023 0.0973 0.0960 0.1471 0.1379 0.1499 0.1641 0.1621 0.1487 0.1589 0.1616 0.1627 0.1622
va: 2.1040 2.0287 2.0542 3.1114 3.7148 3.7177 3.8937 3.9173 3.9028 3.9056 3.9006 4.1299 3.7081 3.6213 4.0829 4.0173 3.9877 3.7779 3.8928 3.9111 3.6628 4.0037 3.8783 3.8842 3.9071 3.8942 1.0327 1.0117 0.9999 0.9969 1.0022 0.9992 1.0052 0.9986 1.0021 1.0047 0.9989 0.9984 1.0119 1.0157 1.0273 1.0010 0.9889 0.9928 1.0073 0.9964 0.9879 0.9897 0.9888
dispcorr: -0.025179976 hartree
energy: -1132.708904683211
dipole: 28.59857 -27.27739 1.32118 -3.90845 2.54544 -1.36300 -7.87249 6.64292 -1.22957
magnitude: 2.26166 au
magnitude: 5.74869 debye
