program: Orca
programVersion: 5.0.2
elementType: O O O N C C C C C C C C C C C C C C C C C C C C C C H H H H H H H H H H H H H H H H H H H H H H H
charge: 0
multiplicity: 1
keywords: wb97x-d3
keywords: def2-TZVPP
keywords: def2/J RIJCOSX
keywords: DEFGRID2
keywords: scfconv7
keywords: smallprint printgap noloewdin
keywords: NOSOSCF
formula: C22H23NO3
InChI: InChI=1/C22H23NO3/c1-21(2)19(22(21,3)4)20(24)26-18(14-23)15-9-8-12-17(13-15)25-16-10-6-5-7-11-16/h5-13,18-19H,1-4H3
49 atoms
O  0.096162 1.966245 0.771361
O  0.695536 2.114461 -1.376026
O  -2.340599 -2.287796 -0.667747
N  -2.250658 3.223838 2.695083
C  2.882217 0.030653 -0.28104
C  3.5898 1.341787 -0.413697
C  2.243866 1.301918 0.291811
C  2.276344 -0.641831 -1.490202
C  3.327819 -0.987252 0.744327
C  4.76889 1.653179 0.483795
C  3.761105 2.000775 -1.764027
C  0.988562 1.835507 -0.240287
C  -1.202606 2.41075 0.441187
C  -2.089974 1.338329 -0.161369
C  -1.778552 2.856202 1.712982
C  -1.738072 -0.004156 -0.101764
C  -3.286089 1.738177 -0.740165
C  -2.606481 -0.950025 -0.635177
C  -4.145935 0.779341 -1.254741
C  -3.814959 -0.563409 -1.203965
C  -1.278444 -2.815547 0.032461
C  -0.267845 -3.430627 -0.689139
C  -1.257775 -2.795395 1.420381
C  0.776055 -4.044556 -0.009645
C  -0.20216 -3.40037 2.086973
C  0.814728 -4.027392 1.377459
H  2.298111 1.365003 1.372748
H  1.425899 -1.258979 -1.194472
H  1.932331 0.0357 -2.26602
H  3.015591 -1.305523 -1.94387
H  2.505608 -1.66669 0.978578
H  4.150052 -1.590858 0.35426
H  3.655116 -0.542139 1.681667
H  4.935617 2.731375 0.520433
H  4.635933 1.313316 1.50911
H  5.678769 1.192826 0.093587
H  4.725886 1.705237 -2.181507
H  3.003451 1.750319 -2.499333
H  3.773447 3.08702 -1.659344
H  -1.172258 3.280833 -0.224439
H  -0.804697 -0.310967 0.351786
H  -3.546712 2.788226 -0.785962
H  -5.082934 1.080409 -1.703677
H  -4.482966 -1.312171 -1.609898
H  -0.301513 -3.436308 -1.771173
H  -2.056183 -2.318814 1.975444
H  1.564251 -4.52876 -0.571061
H  -0.18007 -3.386366 3.16864
H  1.631868 -4.501349 1.904571
elementType: O N C H
totalener: -1132.68335156 hartree
nucrepener: 2333.27421281 hartree
electener: -3465.95756436 hartree
oneelecener: -6175.31588190 hartree
twoeener: 2709.35831754 hartree
cpcmener: -0.03360610 hartree
kineticenergy: 1127.64442587 hartree
xcener: -110.661052998589 hartree
chargesum: -0.0000000
charge: -0.294942 -0.466759 -0.333245 -0.100800 0.134035 0.109266 -0.117692 -0.297560 -0.282474 -0.287543 -0.305338 0.370317 0.401314 0.018472 -0.226828 -0.222251 -0.254041 0.337413 -0.096670 -0.260617 0.287458 -0.230169 -0.208209 -0.149028 -0.122031 -0.171848 0.088617 0.070090 0.104334 0.110125 0.071742 0.103568 0.097366 0.096835 0.092736 0.100120 0.097789 0.093992 0.103151 0.148627 0.133952 0.148980 0.161955 0.148850 0.152877 0.157473 0.161353 0.163433 0.161804
qa: -0.2949 -0.4668 -0.3332 -0.1008 0.1340 0.1093 -0.1177 -0.2976 -0.2825 -0.2875 -0.3053 0.3703 0.4013 0.0185 -0.2268 -0.2223 -0.2540 0.3374 -0.0967 -0.2606 0.2875 -0.2302 -0.2082 -0.1490 -0.1220 -0.1718 0.0886 0.0701 0.1043 0.1101 0.0717 0.1036 0.0974 0.0968 0.0927 0.1001 0.0978 0.0940 0.1032 0.1486 0.1340 0.1490 0.1620 0.1488 0.1529 0.1575 0.1614 0.1634 0.1618
va: 2.0966 2.0306 2.0825 3.1155 3.6586 3.7386 3.9125 3.8958 3.9065 3.9039 3.8990 4.1081 3.7171 3.6822 4.0718 3.9478 4.0056 3.6840 3.8827 3.9993 3.6357 3.9516 3.9453 3.8212 3.8420 3.8399 1.0344 1.0186 1.0177 0.9995 1.0130 0.9987 1.0090 1.0019 1.0058 0.9988 0.9983 1.0129 0.9989 1.0179 1.0205 1.0015 0.9873 1.0073 1.0041 0.9972 0.9895 0.9872 0.9899
dispcorr: -0.027808421 hartree
energy: -1132.711159976697
dipole: 29.55710 -27.90141 1.65569 -4.89227 3.76615 -1.12612 -4.72869 4.23892 -0.48976
magnitude: 2.06139 au
magnitude: 5.23963 debye
