program: Orca
programVersion: 5.0.2
elementType: O O O N C C C C C C C C C C C C C C C C C C C C C C H H H H H H H H H H H H H H H H H H H H H H H
charge: 0
multiplicity: 1
keywords: wb97x-d3
keywords: def2-TZVPP
keywords: def2/J RIJCOSX
keywords: DEFGRID2
keywords: scfconv7
keywords: smallprint printgap noloewdin
keywords: NOSOSCF
formula: C22H23NO3
InChI: InChI=1/C22H23NO3/c1-21(2)19(22(21,3)4)20(24)26-18(14-23)15-9-8-12-17(13-15)25-16-10-6-5-7-11-16/h5-13,18-19H,1-4H3
49 atoms
O  0.697417 1.326409 0.40787
O  0.853128 2.909694 -1.162298
O  -2.427093 -2.795255 -0.599196
N  -1.154793 1.310838 3.147753
C  3.683041 1.73937 -1.790389
C  3.961779 2.508756 -0.538322
C  2.763494 1.555193 -0.589065
C  3.217521 2.444108 -3.044317
C  4.533801 0.535474 -2.138586
C  5.093401 2.089325 0.374071
C  3.744514 4.002913 -0.483862
C  1.37609 2.030383 -0.526009
C  -0.675639 1.638499 0.59939
C  -1.566074 0.746567 -0.230495
C  -0.929724 1.449902 2.030051
C  -1.561658 -0.625235 0.000091
C  -2.363592 1.294906 -1.223952
C  -2.389557 -1.442243 -0.754726
C  -3.172036 0.461158 -1.985317
C  -3.195836 -0.902864 -1.751166
C  -2.245662 -3.359668 0.636577
C  -2.879749 -2.867721 1.77144
C  -1.44739 -4.491919 0.704345
C  -2.695386 -3.517201 2.983083
C  -1.282801 -5.13872 1.921246
C  -1.898579 -4.651621 3.065428
H  2.914605 0.632181 -0.040136
H  2.677168 3.369805 -2.876852
H  4.08755 2.68384 -3.659639
H  2.574126 1.790191 -3.635981
H  5.471674 0.847897 -2.603127
H  4.779686 -0.087242 -1.28044
H  4.009452 -0.098888 -2.856259
H  4.929688 2.47498 1.382303
H  5.206859 1.0102 0.457192
H  6.042283 2.496881 0.017996
H  2.929429 4.368864 -1.101248
H  3.54243 4.317786 0.542028
H  4.653057 4.516122 -0.80667
H  -0.880464 2.689019 0.373172
H  -0.923862 -1.048718 0.767575
H  -2.359376 2.362708 -1.401279
H  -3.799002 0.879201 -2.761718
H  -3.836213 -1.552318 -2.334763
H  -3.513842 -1.991273 1.718838
H  -0.964281 -4.86605 -0.189733
H  -3.186119 -3.132988 3.86812
H  -0.662006 -6.023937 1.972356
H  -1.762146 -5.153177 4.014462
elementType: O N C H
totalener: -1132.69662719 hartree
nucrepener: 2216.39012101 hartree
electener: -3349.08674820 hartree
oneelecener: -5941.88524322 hartree
twoeener: 2592.79849502 hartree
cpcmener: -0.02705667 hartree
kineticenergy: 1127.65785875 hartree
xcener: -110.658128804579 hartree
chargesum: 0.0000000
charge: -0.294659 -0.456619 -0.327212 -0.092495 0.102284 0.095785 -0.125731 -0.299644 -0.283812 -0.278880 -0.299599 0.386979 0.425205 0.021341 -0.229365 -0.209450 -0.192399 0.246884 -0.117143 -0.230768 0.282077 -0.192541 -0.245901 -0.139589 -0.121340 -0.183943 0.086447 0.097841 0.096198 0.100504 0.098858 0.091669 0.095918 0.095141 0.090851 0.099173 0.097672 0.100369 0.101690 0.131665 0.146904 0.146069 0.159199 0.147667 0.155520 0.145963 0.159338 0.157918 0.157966
qa: -0.2947 -0.4566 -0.3272 -0.0925 0.1023 0.0958 -0.1257 -0.2996 -0.2838 -0.2789 -0.2996 0.3870 0.4252 0.0213 -0.2294 -0.2095 -0.1924 0.2469 -0.1171 -0.2308 0.2821 -0.1925 -0.2459 -0.1396 -0.1213 -0.1839 0.0864 0.0978 0.0962 0.1005 0.0989 0.0917 0.0959 0.0951 0.0909 0.0992 0.0977 0.1004 0.1017 0.1317 0.1469 0.1461 0.1592 0.1477 0.1555 0.1460 0.1593 0.1579 0.1580
va: 2.1215 2.0485 2.0842 3.1083 3.6947 3.7206 3.9116 3.9048 3.9082 3.9044 3.9153 4.1302 3.7186 3.6246 4.0785 3.9648 3.9492 3.7760 3.9061 4.0081 3.6925 3.9125 4.0131 3.8896 3.8833 3.9069 1.0319 1.0117 0.9986 0.9996 0.9991 1.0055 1.0023 1.0031 1.0057 0.9990 1.0128 0.9998 0.9981 1.0251 1.0124 1.0063 0.9895 1.0054 0.9973 1.0077 0.9900 0.9891 0.9905
dispcorr: -0.023479013 hartree
energy: -1132.720106203012
dipole: 29.76230 -28.75875 1.00355 9.99383 -10.26260 -0.26877 -9.80754 8.72235 -1.08519
magnitude: 1.50233 au
magnitude: 3.81861 debye
