program: Orca
programVersion: 5.0.2
elementType: O O O N C C C C C C C C C C C C C C C C C C C C C C H H H H H H H H H H H H H H H H H H H H H H H
charge: 0
multiplicity: 1
keywords: wb97x-d3
keywords: def2-TZVPP
keywords: def2/J RIJCOSX
keywords: DEFGRID2
keywords: scfconv7
keywords: smallprint printgap noloewdin
keywords: NOSOSCF
formula: C22H23NO3
InChI: InChI=1/C22H23NO3/c1-21(2)19(22(21,3)4)20(24)26-18(14-23)15-9-8-12-17(13-15)25-16-10-6-5-7-11-16/h5-13,18-19H,1-4H3
49 atoms
O  0.363079 1.792839 0.419422
O  0.347424 3.141836 -1.355314
O  -2.695635 -2.428195 -0.695561
N  -1.511436 1.586805 3.122644
C  3.433811 1.974796 0.317247
C  3.089588 0.776403 -0.514896
C  2.387982 2.102673 -0.78635
C  3.057189 2.043168 1.78065
C  4.730951 2.717726 0.071862
C  4.037128 0.311073 -1.602122
C  2.358355 -0.4048 0.083773
C  0.952906 2.405974 -0.623987
C  -1.029399 2.020192 0.590608
C  -1.857103 1.116445 -0.290275
C  -1.291319 1.771929 2.010873
C  -1.860074 -0.254319 -0.055492
C  -2.584459 1.655266 -1.338972
C  -2.605558 -1.0849 -0.879346
C  -3.335372 0.814574 -2.148295
C  -3.346292 -0.550081 -1.928449
C  -1.692259 -3.090602 -0.041431
C  -2.012314 -3.812356 1.097057
C  -0.393908 -3.081389 -0.533597
C  -1.021311 -4.534368 1.746521
C  0.589261 -3.797195 0.130113
C  0.280615 -4.525764 1.270504
H  2.75002 2.616019 -1.670536
H  2.155821 1.50409 2.049933
H  3.872935 1.635741 2.381021
H  2.918848 3.081521 2.086714
H  4.660216 3.735695 0.45826
H  5.55738 2.226767 0.58955
H  4.998697 2.792372 -0.979946
H  3.500165 -0.29741 -2.331856
H  4.506134 1.12575 -2.149696
H  4.832752 -0.306549 -1.180532
H  1.728778 -0.175581 0.935769
H  1.724563 -0.878571 -0.667656
H  3.087479 -1.149243 0.409873
H  -1.277253 3.065298 0.38166
H  -1.299749 -0.666115 0.775686
H  -2.557788 2.719232 -1.530376
H  -3.90872 1.226822 -2.967494
H  -3.927274 -1.210392 -2.558635
H  -3.029675 -3.808686 1.465271
H  -0.156724 -2.522852 -1.430328
H  -1.270901 -5.100272 2.634082
H  1.601741 -3.788963 -0.251473
H  1.050827 -5.08648 1.782374
totalener: -1132.67089966 hartree
nucrepener: 2312.57521376 hartree
electener: -3445.24611342 hartree
oneelecener: -6133.54513991 hartree
twoeener: 2688.29902649 hartree
kineticenergy: 1127.72921581 hartree
xcener: -110.667553675527 hartree
chargesum: -0.0000000
charge: -0.265040 -0.363232 -0.298160 -0.000469 0.089269 0.134425 -0.154461 -0.267463 -0.265680 -0.265103 -0.287502 0.358149 0.288545 0.029812 -0.275540 -0.180667 -0.130304 0.207227 -0.090615 -0.197849 0.230081 -0.178496 -0.177684 -0.102683 -0.119278 -0.127635 0.079826 0.095754 0.088532 0.092857 0.092516 0.091707 0.078382 0.090611 0.079671 0.091510 0.090947 0.076784 0.088519 0.122805 0.130890 0.115772 0.127586 0.127626 0.127512 0.136417 0.127815 0.129397 0.126920
qa: -0.2650 -0.3632 -0.2982 -0.0005 0.0893 0.1344 -0.1545 -0.2675 -0.2657 -0.2651 -0.2875 0.3581 0.2885 0.0298 -0.2755 -0.1807 -0.1303 0.2072 -0.0906 -0.1978 0.2301 -0.1785 -0.1777 -0.1027 -0.1193 -0.1276 0.0798 0.0958 0.0885 0.0929 0.0925 0.0917 0.0784 0.0906 0.0797 0.0915 0.0909 0.0768 0.0885 0.1228 0.1309 0.1158 0.1276 0.1276 0.1275 0.1364 0.1278 0.1294 0.1269
va: 2.1057 2.1486 2.1158 3.1154 3.7149 3.6699 3.9327 3.9258 3.9182 3.9184 3.9201 4.2112 3.8831 3.6301 4.0185 3.9391 3.9991 3.8821 3.9590 4.0335 3.8246 4.0399 3.9577 3.9430 3.9194 3.9621 1.0301 1.0106 1.0002 1.0033 1.0052 1.0008 1.0106 1.0039 1.0116 1.0012 1.0168 1.0065 1.0022 1.0180 1.0123 1.0206 0.9995 1.0122 1.0118 1.0005 0.9988 0.9982 0.9998
dispcorr: -0.027027774 hartree
energy: -1132.697927435840
dipole: 29.43785 -28.38392 1.05393 0.86801 -1.43943 -0.57141 -1.42509 0.67265 -0.75244
magnitude: 1.41543 au
magnitude: 3.59775 debye
