program: Orca
programVersion: 5.0.2
elementType: O O O N C C C C C C C C C C C C C C C C C C C C C C H H H H H H H H H H H H H H H H H H H H H H H
charge: 0
multiplicity: 1
keywords: wb97x-d3
keywords: def2-TZVPP
keywords: def2/J RIJCOSX
keywords: DEFGRID2
keywords: scfconv7
keywords: smallprint printgap noloewdin
keywords: NOSOSCF
formula: C22H23NO3
InChI: InChI=1/C22H23NO3/c1-21(2)19(22(21,3)4)20(24)26-18(14-23)15-9-8-12-17(13-15)25-16-10-6-5-7-11-16/h5-13,18-19H,1-4H3
49 atoms
O  0.312346 1.853555 0.722269
O  0.503815 3.538874 -0.731821
O  -2.504718 -2.338771 -0.877673
N  -1.81783 1.488844 3.229311
C  3.222673 1.201606 0.48564
C  2.912433 1.016273 -0.973566
C  2.435636 2.269569 -0.247207
C  2.621893 0.278927 1.526278
C  4.620162 1.61669 0.902031
C  3.985909 1.203526 -2.021959
C  1.899613 -0.018565 -1.409414
C  1.00665 2.629432 -0.130263
C  -1.093385 2.063661 0.786167
C  -1.804749 1.19698 -0.222953
C  -1.486403 1.736605 2.158248
C  -1.829265 -0.181137 -0.04109
C  -2.376351 1.770488 -1.347192
C  -2.428043 -0.987297 -0.997529
C  -2.990994 0.954167 -2.287226
C  -3.016442 -0.418526 -2.122444
C  -1.554976 -2.988277 -0.133919
C  -1.961509 -3.730138 0.962386
C  -0.215204 -2.929239 -0.49381
C  -1.013802 -4.419907 1.705736
C  0.723177 -3.609962 0.264222
C  0.328804 -4.356211 1.36636
H  3.003497 3.157551 -0.506345
H  1.685388 -0.187965 1.241043
H  3.332919 -0.523525 1.7329
H  2.450986 0.810454 2.462903
H  5.057018 2.381285 0.262204
H  4.60136 2.021806 1.915153
H  5.295607 0.7591 0.903772
H  3.536801 1.46955 -2.980193
H  4.701314 1.98424 -1.772911
H  4.5456 0.276965 -2.166228
H  1.067368 -0.148841 -0.723726
H  1.47785 0.252688 -2.379006
H  2.386679 -0.989892 -1.523147
H  -1.333932 3.115975 0.609285
H  -1.393988 -0.619946 0.849203
H  -2.334391 2.841344 -1.494439
H  -3.444692 1.392863 -3.165682
H  -3.488435 -1.057848 -2.856821
H  -3.009905 -3.765897 1.227258
H  0.088742 -2.359089 -1.362286
H  -1.329587 -5.000624 2.562054
H  1.768156 -3.559318 -0.012266
H  1.064463 -4.887888 1.954347
totalener: -1132.67023839 hartree
nucrepener: 2340.51075306 hartree
electener: -3473.18099146 hartree
oneelecener: -6189.26119159 hartree
twoeener: 2716.08020014 hartree
kineticenergy: 1127.73384070 hartree
xcener: -110.668235587725 hartree
chargesum: -0.0000000
charge: -0.250445 -0.358004 -0.298707 -0.001963 0.123599 0.089830 -0.143952 -0.235049 -0.277971 -0.258702 -0.254388 0.334928 0.271162 0.031463 -0.258176 -0.205917 -0.140110 0.223754 -0.087018 -0.197866 0.217434 -0.168969 -0.172599 -0.107639 -0.133302 -0.116286 0.078218 0.071148 0.083396 0.099695 0.078373 0.094601 0.092232 0.093678 0.077779 0.089226 0.014119 0.107288 0.096864 0.124589 0.135245 0.120864 0.128250 0.129127 0.128305 0.153029 0.128633 0.122569 0.127665
qa: -0.2504 -0.3580 -0.2987 -0.0020 0.1236 0.0898 -0.1440 -0.2350 -0.2780 -0.2587 -0.2544 0.3349 0.2712 0.0315 -0.2582 -0.2059 -0.1401 0.2238 -0.0870 -0.1979 0.2174 -0.1690 -0.1726 -0.1076 -0.1333 -0.1163 0.0782 0.0711 0.0834 0.0997 0.0784 0.0946 0.0922 0.0937 0.0778 0.0892 0.0141 0.1073 0.0969 0.1246 0.1352 0.1209 0.1283 0.1291 0.1283 0.1530 0.1286 0.1226 0.1277
va: 2.1177 2.1441 2.1191 3.1154 3.6621 3.7979 3.9047 3.9154 3.9179 3.9094 3.9318 4.2524 3.8810 3.6223 4.0282 3.9110 4.0037 3.8680 3.9533 4.0380 3.8604 4.0275 3.9447 3.9439 3.9420 3.9565 1.0302 1.0073 1.0010 1.0090 1.0093 1.0045 1.0007 1.0053 1.0105 1.0006 1.0166 1.0055 0.9969 1.0240 1.0151 1.0183 0.9991 1.0116 1.0112 0.9875 0.9988 1.0048 0.9993
dispcorr: -0.028435823 hartree
energy: -1132.698674216259
dipole: 27.77290 -26.74113 1.03177 -2.33229 1.63307 -0.69922 -4.80193 3.83078 -0.97115
magnitude: 1.58006 au
magnitude: 4.01620 debye
