program: Orca
programVersion: 5.0.2
elementType: O O O N C C C C C C C C C C C C C C C C C C C C C C H H H H H H H H H H H H H H H H H H H H H H H
charge: 0
multiplicity: 1
keywords: wb97x-d3
keywords: def2-TZVPP
keywords: def2/J RIJCOSX
keywords: DEFGRID2
keywords: scfconv7
keywords: smallprint printgap noloewdin
keywords: NOSOSCF
formula: C22H23NO3
InChI: InChI=1/C22H23NO3/c1-21(2)19(22(21,3)4)20(24)26-18(14-23)15-9-8-12-17(13-15)25-16-10-6-5-7-11-16/h5-13,18-19H,1-4H3
49 atoms
O  0.250537 1.749981 0.070669
O  0.984837 3.779852 0.621219
O  -2.629976 -2.396685 -0.657744
N  -1.64976 2.183613 2.827999
C  3.154173 0.818769 0.583442
C  3.047596 1.049741 -0.894488
C  2.592997 2.140729 0.066862
C  2.271786 -0.195078 1.277701
C  4.500484 0.906417 1.271451
C  4.291163 1.375422 -1.697087
C  2.073642 0.253501 -1.73574
C  1.2266 2.652949 0.287176
C  -1.087245 2.171871 0.272053
C  -1.980484 1.20165 -0.458082
C  -1.389195 2.188738 1.70943
C  -1.887414 -0.154933 -0.170218
C  -2.862975 1.658215 -1.422235
C  -2.666114 -1.057616 -0.87731
C  -3.65956 0.746586 -2.103735
C  -3.560794 -0.606792 -1.844057
C  -1.52419 -2.950479 -0.06967
C  -1.689524 -3.646468 1.115983
C  -0.274511 -2.851932 -0.668139
C  -0.591311 -4.25554 1.706386
C  0.816387 -3.453546 -0.062136
C  0.663301 -4.156733 1.125023
H  3.287549 2.969368 0.153392
H  2.074667 0.113168 2.30585
H  1.31351 -0.373433 0.801827
H  2.788348 -1.155923 1.320657
H  4.36558 1.097991 2.337091
H  5.043186 -0.035792 1.172492
H  5.137868 1.697576 0.882364
H  4.84193 0.464586 -1.940361
H  4.015615 1.853928 -2.638343
H  4.975462 2.048714 -1.1850
H  1.744782 0.838416 -2.596318
H  2.582266 -0.632982 -2.121608
H  1.184351 -0.080841 -1.21351
H  -1.239012 3.185775 -0.109815
H  -1.213253 -0.500188 0.603865
H  -2.931203 2.714818 -1.646867
H  -4.354059 1.095293 -2.855977
H  -4.169059 -1.322452 -2.381207
H  -2.67076 -3.709877 1.567302
H  -0.157292 -2.311725 -1.599255
H  -0.719426 -4.801388 2.631517
H  1.7911 -3.373352 -0.525031
H  1.517622 -4.627492 1.592205
totalener: -1132.67007580 hartree
nucrepener: 2333.59895926 hartree
electener: -3466.26903507 hartree
oneelecener: -6175.34832396 hartree
twoeener: 2709.07928889 hartree
kineticenergy: 1127.73222963 hartree
xcener: -110.668191357194 hartree
chargesum: 0.0000000
charge: -0.268031 -0.348358 -0.297109 0.002189 0.110755 0.114852 -0.150808 -0.240376 -0.264180 -0.267674 -0.230423 0.334510 0.277408 0.070865 -0.248207 -0.234844 -0.162294 0.237142 -0.084856 -0.205044 0.240957 -0.177655 -0.186704 -0.101049 -0.140134 -0.113531 0.079269 0.108436 0.033955 0.082308 0.095475 0.089478 0.077750 0.091006 0.091756 0.079230 0.097029 0.086153 0.037254 0.111345 0.147120 0.114382 0.127485 0.128642 0.128326 0.142079 0.128760 0.128144 0.127215
qa: -0.2680 -0.3484 -0.2971 0.0022 0.1108 0.1149 -0.1508 -0.2404 -0.2642 -0.2677 -0.2304 0.3345 0.2774 0.0709 -0.2482 -0.2348 -0.1623 0.2371 -0.0849 -0.2050 0.2410 -0.1777 -0.1867 -0.1010 -0.1401 -0.1135 0.0793 0.1084 0.0340 0.0823 0.0955 0.0895 0.0778 0.0910 0.0918 0.0792 0.0970 0.0862 0.0373 0.1113 0.1471 0.1144 0.1275 0.1286 0.1283 0.1421 0.1288 0.1281 0.1272
va: 2.1275 2.1623 2.1260 3.1159 3.6947 3.6896 3.9281 3.9326 3.9191 3.9175 3.9302 4.2352 3.9090 3.6730 3.9861 3.9467 3.9946 3.8630 3.9632 4.0437 3.8068 4.0398 3.9281 3.9422 3.9063 3.9368 1.0308 1.0076 1.0125 1.0037 1.0047 1.0005 1.0109 1.0006 1.0049 1.0112 1.0097 0.9999 1.0067 1.0323 1.0040 1.0097 0.9999 1.0123 1.0117 0.9957 0.9985 1.0008 0.9995
dispcorr: -0.028212432 hartree
energy: -1132.698288236854
dipole: 27.27413 -26.45906 0.81507 -4.59843 3.40926 -1.18917 -5.31440 3.82184 -1.49256
magnitude: 2.07515 au
magnitude: 5.27460 debye
