program: Orca
programVersion: 5.0.2
elementType: O O O N C C C C C C C C C C C C C C C C C C C C C C H H H H H H H H H H H H H H H H H H H H H H H
charge: 0
multiplicity: 1
keywords: wb97x-d3
keywords: def2-TZVPP
keywords: def2/J RIJCOSX
keywords: DEFGRID2
keywords: scfconv7
keywords: smallprint printgap noloewdin
keywords: NOSOSCF
formula: C22H23NO3
InChI: InChI=1/C22H23NO3/c1-21(2)19(22(21,3)4)20(24)26-18(14-23)15-9-8-12-17(13-15)25-16-10-6-5-7-11-16/h5-13,18-19H,1-4H3
49 atoms
O  0.086516 1.580978 -1.487411
O  0.345103 2.23604 0.626792
O  -2.684267 -2.48649 0.047563
N  -1.594169 4.520427 -1.047308
C  3.411977 1.893846 0.089311
C  2.987631 0.514071 0.484014
C  2.193469 1.267026 -0.579318
C  3.261913 3.051945 1.050219
C  4.618654 2.093569 -0.803351
C  3.757629 -0.692833 -0.007853
C  2.389292 0.254922 1.847676
C  0.820828 1.748696 -0.359754
C  -1.277272 1.950856 -1.413196
C  -2.080648 1.084199 -0.465502
C  -1.432301 3.389484 -1.165442
C  -1.977064 -0.292783 -0.617156
C  -2.932823 1.615319 0.491093
C  -2.724337 -1.13147 0.196942
C  -3.687644 0.765792 1.285065
C  -3.584774 -0.608389 1.150517
C  -1.480326 -3.126419 0.006485
C  -0.393509 -2.723874 0.77365
C  -1.391982 -4.25089 -0.802653
C  0.780955 -3.45965 0.723357
C  -0.212461 -4.977391 -0.839182
C  0.880829 -4.585435 -0.080585
H  2.360132 0.920296 -1.593275
H  2.418783 2.975357 1.727404
H  4.168917 3.138018 1.651827
H  3.147222 3.986275 0.498566
H  5.538773 2.064748 -0.216577
H  4.707724 1.350969 -1.593953
H  4.567793 3.070664 -1.286133
H  4.158216 -0.575075 -1.012557
H  4.595411 -0.909679 0.65787
H  3.108891 -1.570489 -0.023068
H  3.189022 0.074501 2.568601
H  1.769871 1.059274 2.229302
H  1.768596 -0.642754 1.817239
H  -1.64565 1.781854 -2.42936
H  -1.318607 -0.717825 -1.365709
H  -3.007652 2.685585 0.627166
H  -4.351099 1.181256 2.031398
H  -4.164318 -1.276499 1.773476
H  -0.462092 -1.852433 1.41254
H  -2.24868 -4.552043 -1.391126
H  1.622194 -3.15204 1.331245
H  -0.149239 -5.854592 -1.469411
H  1.799569 -5.155001 -0.110835
totalener: -1132.67187007 hartree
nucrepener: 2318.94621480 hartree
electener: -3451.61808487 hartree
oneelecener: -6146.41145621 hartree
twoeener: 2694.79337134 hartree
kineticenergy: 1127.72961098 hartree
xcener: -110.670654087413 hartree
chargesum: 0.0000000
charge: -0.287240 -0.372116 -0.300928 0.001754 0.076540 0.098919 -0.099861 -0.272566 -0.257043 -0.255175 -0.270986 0.337481 0.438314 -0.028708 -0.290492 -0.225817 -0.128414 0.193186 -0.088733 -0.186132 0.226724 -0.130229 -0.212248 -0.146145 -0.085852 -0.151567 0.072626 0.105118 0.086863 0.092499 0.092928 0.076574 0.092460 0.077538 0.093060 0.082768 0.095762 0.112381 0.051616 0.122169 0.130018 0.121033 0.129650 0.128712 0.136659 0.126696 0.138826 0.125908 0.125468
qa: -0.2872 -0.3721 -0.3009 0.0018 0.0765 0.0989 -0.0999 -0.2726 -0.2570 -0.2552 -0.2710 0.3375 0.4383 -0.0287 -0.2905 -0.2258 -0.1284 0.1932 -0.0887 -0.1861 0.2267 -0.1302 -0.2122 -0.1461 -0.0859 -0.1516 0.0726 0.1051 0.0869 0.0925 0.0929 0.0766 0.0925 0.0775 0.0931 0.0828 0.0958 0.1124 0.0516 0.1222 0.1300 0.1210 0.1296 0.1287 0.1367 0.1267 0.1388 0.1259 0.1255
va: 2.1071 2.1163 2.1059 3.1164 3.7579 3.6959 3.9450 3.9247 3.9016 3.9037 3.9205 4.1349 3.9050 3.7512 4.0653 3.9776 3.9697 3.8695 3.9531 4.0409 3.8547 3.8886 4.0352 3.9317 3.9442 3.9863 1.0345 1.0183 0.9983 1.0033 1.0009 1.0101 1.0059 1.0136 0.9999 1.0152 1.0007 1.0204 1.0191 0.9874 1.0185 1.0256 1.0001 1.0103 1.0021 1.0137 0.9900 0.9980 1.0018
dispcorr: -0.026652878 hartree
energy: -1132.698522944403
dipole: 29.78923 -28.84884 0.94039 -2.29338 0.75481 -1.53857 6.08830 -6.30250 -0.21420
magnitude: 1.81588 au
magnitude: 4.61559 debye
