program: Orca
programVersion: 5.0.2
elementType: O O O N C C C C C C C C C C C C C C C C C C C C C C H H H H H H H H H H H H H H H H H H H H H H H
charge: 0
multiplicity: 1
keywords: wb97x-d3
keywords: def2-TZVPP
keywords: def2/J RIJCOSX
keywords: DEFGRID2
keywords: scfconv7
keywords: smallprint printgap noloewdin
keywords: NOSOSCF
formula: C22H23NO3
InChI: InChI=1/C22H23NO3/c1-21(2)19(22(21,3)4)20(24)26-18(14-23)15-9-8-12-17(13-15)25-16-10-6-5-7-11-16/h5-13,18-19H,1-4H3
49 atoms
O  0.719927 1.957946 0.235258
O  1.143351 2.871671 -1.765311
O  -2.707007 -2.213922 1.373292
N  -1.837005 3.068856 2.034083
C  4.145166 2.316069 -1.161507
C  3.904958 3.570643 -0.381191
C  2.938086 2.39483 -0.236391
C  3.981761 2.299354 -2.665199
C  5.233343 1.354243 -0.732458
C  4.743749 3.885989 0.838833
C  3.468221 4.839123 -1.078062
C  1.546331 2.453419 -0.712393
C  -0.678547 1.96945 -0.033488
C  -1.169368 0.572689 -0.326147
C  -1.323683 2.57408 1.133707
C  -1.723498 -0.224451 0.661017
C  -1.011604 0.079318 -1.618297
C  -2.133512 -1.518633 0.357787
C  -1.415216 -1.212012 -1.905274
C  -1.979615 -2.019856 -0.928127
C  -2.840105 -3.573199 1.276061
C  -4.115133 -4.111036 1.210304
C  -1.721813 -4.39577 1.295366
C  -4.271752 -5.489325 1.172533
C  -1.890483 -5.77052 1.250669
C  -3.163083 -6.321718 1.188621
H  3.038638 1.848146 0.694676
H  4.931345 2.56884 -3.131682
H  3.725199 1.294817 -3.005711
H  3.220958 2.971026 -3.045777
H  5.035759 0.36107 -1.138874
H  6.203529 1.678319 -1.113719
H  5.321427 1.246682 0.346614
H  5.670882 4.383445 0.547621
H  4.202596 4.56233 1.502176
H  5.009982 3.008013 1.4232
H  2.819731 4.682354 -1.933579
H  2.932993 5.485417 -0.380113
H  4.347107 5.388307 -1.42099
H  -0.889466 2.612866 -0.89279
H  -1.861011 0.144484 1.670234
H  -0.580279 0.702459 -2.390847
H  -1.302704 -1.59939 -2.909022
H  -2.303437 -3.021734 -1.17622
H  -4.974014 -3.452976 1.199518
H  -0.731324 -3.9629 1.353824
H  -5.266772 -5.911623 1.127235
H  -1.021251 -6.414417 1.271313
H  -3.288938 -7.395536 1.159243
totalener: -1132.67560942 hartree
nucrepener: 2164.51284548 hartree
electener: -3297.18845490 hartree
oneelecener: -5837.59383240 hartree
twoeener: 2540.40537751 hartree
kineticenergy: 1127.71299921 hartree
xcener: -110.664491231024 hartree
chargesum: -0.0000000
charge: -0.262279 -0.402102 -0.289430 -0.006453 0.092656 0.074572 -0.136016 -0.273474 -0.256136 -0.254421 -0.279876 0.370018 0.321395 -0.002094 -0.255495 -0.197852 -0.151823 0.213275 -0.138315 -0.146359 0.195897 -0.166201 -0.145969 -0.112866 -0.122319 -0.122451 0.076434 0.087876 0.086469 0.104571 0.090420 0.091904 0.077665 0.092647 0.093165 0.077616 0.104026 0.091230 0.091104 0.124840 0.123197 0.135615 0.129196 0.130467 0.128295 0.132871 0.128014 0.128234 0.128266
qa: -0.2623 -0.4021 -0.2894 -0.0065 0.0927 0.0746 -0.1360 -0.2735 -0.2561 -0.2544 -0.2799 0.3700 0.3214 -0.0021 -0.2555 -0.1979 -0.1518 0.2133 -0.1383 -0.1464 0.1959 -0.1662 -0.1460 -0.1129 -0.1223 -0.1225 0.0764 0.0879 0.0865 0.1046 0.0904 0.0919 0.0777 0.0926 0.0932 0.0776 0.1040 0.0912 0.0911 0.1248 0.1232 0.1356 0.1292 0.1305 0.1283 0.1329 0.1280 0.1282 0.1283
va: 2.1209 2.0897 2.1137 3.1172 3.7113 3.7467 3.9409 3.9176 3.9075 3.9058 3.9261 4.1454 3.7951 3.8096 4.0306 4.0952 3.9588 3.9183 3.9921 3.9240 3.8451 4.0215 3.9781 3.9408 3.9424 3.9418 1.0343 0.9994 1.0036 1.0176 1.0056 1.0013 1.0104 1.0009 1.0061 1.0103 1.0159 1.0028 0.9995 1.0300 1.0343 1.0167 1.0022 1.0082 1.0107 1.0033 0.9993 0.9997 0.9997
dispcorr: -0.022930131 hartree
energy: -1132.698539550044
dipole: 32.00358 -30.88035 1.12323 9.29993 -10.66411 -1.36418 -9.53457 8.65641 -0.87815
magnitude: 1.97327 au
magnitude: 5.01565 debye
