program: Orca
programVersion: 5.0.2
elementType: O O O N C C C C C C C C C C C C C C C C C C C C C C H H H H H H H H H H H H H H H H H H H H H H H
charge: 0
multiplicity: 1
keywords: wb97x-d3
keywords: def2-TZVPP
keywords: def2/J RIJCOSX
keywords: DEFGRID2
keywords: scfconv7
keywords: smallprint printgap noloewdin
keywords: NOSOSCF
formula: C22H23NO3
InChI: InChI=1/C22H23NO3/c1-21(2)19(22(21,3)4)20(24)26-18(14-23)15-9-8-12-17(13-15)25-16-10-6-5-7-11-16/h5-13,18-19H,1-4H3
49 atoms
O  0.309497 1.873924 0.169919
O  0.385205 2.339673 -2.007555
O  -2.466537 -2.352675 -0.464831
N  -1.584614 2.833456 2.697152
C  3.40195 1.572479 -0.073167
C  2.822976 0.191676 -0.140203
C  2.265289 1.279933 -1.048812
C  3.180309 2.444184 1.142174
C  4.749347 1.865696 -0.698291
C  3.57829 -0.912489 -0.853338
C  2.049744 -0.382051 1.026427
C  0.917865 1.881202 -1.03563
C  -1.033502 2.317254 0.194345
C  -1.997871 1.280924 -0.340765
C  -1.327481 2.600605 1.602143
C  -1.744368 -0.068001 -0.123477
C  -3.136961 1.688365 -1.012086
C  -2.642535 -1.012677 -0.597397
C  -4.035699 0.732945 -1.466398
C  -3.796399 -0.612604 -1.265494
C  -1.381705 -2.839711 0.213848
C  -0.341217 -3.401789 -0.509316
C  -1.352136 -2.819045 1.601018
C  0.731653 -3.965943 0.166216
C  -0.269903 -3.375813 2.265103
C  0.771966 -3.952435 1.552524
H  2.592828 1.202381 -2.080035
H  3.971576 2.259142 1.871243
H  3.236677 3.498047 0.863513
H  2.232208 2.294616 1.647771
H  4.925591 1.327355 -1.627218
H  4.838209 2.930122 -0.921174
H  5.554678 1.606377 -0.008034
H  4.060174 -0.58831 -1.773473
H  4.3490 -1.333177 -0.204331
H  2.892289 -1.719889 -1.115617
H  1.319482 -1.114593 0.677975
H  2.741386 -0.916889 1.680502
H  1.526631 0.345354 1.636926
H  -1.149034 3.247805 -0.3715
H  -0.85078 -0.373667 0.403861
H  -3.322938 2.739719 -1.189844
H  -4.928071 1.041411 -1.994154
H  -4.488104 -1.361087 -1.628505
H  -0.384225 -3.409456 -1.590619
H  -2.172211 -2.379149 2.153983
H  1.539346 -4.415875 -0.396025
H  -0.24583 -3.362619 3.34655
H  1.610306 -4.391323 2.076304
totalener: -1132.67039806 hartree
nucrepener: 2349.44579121 hartree
electener: -3482.11618927 hartree
oneelecener: -6207.22952847 hartree
twoeener: 2725.11333921 hartree
kineticenergy: 1127.72565039 hartree
xcener: -110.669192961871 hartree
chargesum: 0.0000000
charge: -0.281610 -0.343690 -0.293682 -0.001325 0.081732 0.167274 -0.141807 -0.274698 -0.260688 -0.273631 -0.268013 0.317808 0.253245 0.070221 -0.256538 -0.173650 -0.179821 0.262524 -0.070248 -0.222439 0.191049 -0.113286 -0.136224 -0.165262 -0.123777 -0.109650 0.078751 0.089555 0.093046 0.097154 0.077042 0.092237 0.091184 0.081200 0.091799 0.083811 0.024774 0.098004 0.104139 0.128350 0.110441 0.105522 0.125843 0.126348 0.127450 0.132899 0.128501 0.130686 0.127446
qa: -0.2816 -0.3437 -0.2937 -0.0013 0.0817 0.1673 -0.1418 -0.2747 -0.2607 -0.2736 -0.2680 0.3178 0.2532 0.0702 -0.2565 -0.1736 -0.1798 0.2625 -0.0702 -0.2224 0.1910 -0.1133 -0.1362 -0.1653 -0.1238 -0.1097 0.0788 0.0896 0.0930 0.0972 0.0770 0.0922 0.0912 0.0812 0.0918 0.0838 0.0248 0.0980 0.1041 0.1284 0.1104 0.1055 0.1258 0.1263 0.1275 0.1329 0.1285 0.1307 0.1274
va: 2.0821 2.1650 2.1281 3.1196 3.7388 3.5762 3.9216 3.9265 3.9156 3.9294 3.9161 4.2345 3.8917 3.7181 4.0001 3.9482 4.0568 3.8332 3.9494 4.0391 3.8535 3.9353 3.9477 3.9148 3.9211 3.8771 1.0308 1.0002 1.0028 1.0121 1.0110 1.0053 1.0008 1.0124 1.0007 1.0088 1.0190 1.0051 1.0151 1.0200 1.0305 1.0122 0.9993 1.0145 1.0089 1.0051 1.0009 0.9995 1.0006
dispcorr: -0.028618068 hartree
energy: -1132.699016128735
dipole: 28.18702 -27.16899 1.01803 -2.69355 1.74513 -0.94842 0.75386 -1.18863 -0.43476
magnitude: 1.45771 au
magnitude: 3.70520 debye
