program: Orca
programVersion: 5.0.2
elementType: O O O N C C C C C C C C C C C C C C C C C C C C C C H H H H H H H H H H H H H H H H H H H H H H H
charge: 0
multiplicity: 1
keywords: wb97x-d3
keywords: def2-TZVPP
keywords: def2/J RIJCOSX
keywords: DEFGRID2
keywords: scfconv7
keywords: smallprint printgap noloewdin
keywords: NOSOSCF
formula: C22H23NO3
InChI: InChI=1/C22H23NO3/c1-21(2)19(22(21,3)4)20(24)26-18(14-23)15-9-8-12-17(13-15)25-16-10-6-5-7-11-16/h5-13,18-19H,1-4H3
49 atoms
O  0.312193 1.872108 0.131069
O  0.383261 2.252433 -2.063692
O  -2.474595 -2.354486 -0.41314
N  -1.569033 2.930776 2.628967
C  3.402811 1.558628 -0.106256
C  2.820972 0.177362 -0.114905
C  2.263678 1.228087 -1.06708
C  3.185171 2.480667 1.072185
C  4.749284 1.822925 -0.745993
C  3.571484 -0.957236 -0.783374
C  2.047366 -0.345357 1.075334
C  0.917538 1.83194 -1.075652
C  -1.026991 2.325157 0.144701
C  -2.002975 1.279624 -0.350505
C  -1.313427 2.66257 1.541852
C  -1.745794 -0.065836 -0.117823
C  -3.156697 1.678269 -1.001967
C  -2.65422 -1.016405 -0.559565
C  -4.065899 0.717407 -1.422022
C  -3.822426 -0.625401 -1.207406
C  -1.379386 -2.831035 0.256143
C  -1.339162 -2.80798 1.642917
C  -0.339605 -3.384721 -0.474517
C  -0.247824 -3.355779 2.299564
C  0.742808 -3.939391 0.193596
C  0.793206 -3.924662 1.579633
H  2.589203 1.107254 -2.094767
H  2.238092 2.352888 1.585556
H  3.977851 2.325515 1.80671
H  3.241808 3.522043 0.74992
H  4.83901 2.876446 -1.015524
H  5.555709 1.592812 -0.04673
H  4.922269 1.243893 -1.650569
H  2.882663 -1.773626 -1.007848
H  4.049922 -0.67364 -1.718638
H  4.344232 -1.351743 -0.1203
H  1.534482 0.40952 1.660525
H  1.308962 -1.0832 0.756666
H  2.736559 -0.86256 1.746005
H  -1.137774 3.236378 -0.452828
H  -0.841431 -0.364708 0.394779
H  -3.345806 2.727247 -1.190614
H  -4.96983 1.019122 -1.933748
H  -4.522182 -1.378608 -1.544198
H  -2.15868 -2.373908 2.201258
H  -0.390499 -3.393898 -1.555498
H  -0.215799 -3.34153 3.380803
H  1.549955 -4.383258 -0.37424
H  1.638995 -4.356337 2.097431
totalener: -1132.67033158 hartree
nucrepener: 2350.48445197 hartree
electener: -3483.15478354 hartree
oneelecener: -6209.29827944 hartree
twoeener: 2726.14349589 hartree
kineticenergy: 1127.72739541 hartree
xcener: -110.669619541665 hartree
chargesum: -0.0000000
charge: -0.281885 -0.343207 -0.293448 -0.001031 0.082009 0.164463 -0.139318 -0.274963 -0.261358 -0.273733 -0.264449 0.316010 0.250854 0.070753 -0.256708 -0.166993 -0.180019 0.257931 -0.070917 -0.221005 0.188532 -0.134883 -0.109962 -0.122747 -0.171331 -0.108060 0.078658 0.096767 0.089715 0.093069 0.092456 0.091250 0.077508 0.083916 0.081037 0.091567 0.105073 0.022472 0.098050 0.128853 0.109447 0.105424 0.125950 0.126089 0.132592 0.128034 0.130592 0.129653 0.127293
qa: -0.2819 -0.3432 -0.2934 -0.0010 0.0820 0.1645 -0.1393 -0.2750 -0.2614 -0.2737 -0.2644 0.3160 0.2509 0.0708 -0.2567 -0.1670 -0.1800 0.2579 -0.0709 -0.2210 0.1885 -0.1349 -0.1100 -0.1227 -0.1713 -0.1081 0.0787 0.0968 0.0897 0.0931 0.0925 0.0913 0.0775 0.0839 0.0810 0.0916 0.1051 0.0225 0.0980 0.1289 0.1094 0.1054 0.1259 0.1261 0.1326 0.1280 0.1306 0.1297 0.1273
va: 2.0811 2.1655 2.1278 3.1197 3.7384 3.5757 3.9190 3.9268 3.9158 3.9296 3.9153 4.2349 3.8892 3.7192 3.9989 3.9461 4.0563 3.8357 3.9509 4.0388 3.8591 3.9515 3.9322 3.9203 3.9136 3.8725 1.0308 1.0123 1.0003 1.0028 1.0054 1.0008 1.0107 1.0096 1.0127 1.0010 1.0158 1.0188 1.0051 1.0196 1.0294 1.0121 0.9993 1.0147 1.0053 1.0086 0.9995 1.0003 1.0007
dispcorr: -0.028688499 hartree
energy: -1132.699020075712
dipole: 28.16913 -27.15230 1.01683 -2.72983 1.76833 -0.96150 0.91066 -1.31610 -0.40545
magnitude: 1.45698 au
magnitude: 3.70336 debye
