program: Orca
programVersion: 5.0.2
elementType: O O O N C C C C C C C C C C C C C C C C C C C C C C H H H H H H H H H H H H H H H H H H H H H H H
charge: 0
multiplicity: 1
keywords: wb97x-d3
keywords: def2-TZVPP
keywords: def2/J RIJCOSX
keywords: DEFGRID2
keywords: scfconv7
keywords: smallprint printgap noloewdin
keywords: NOSOSCF
formula: C22H23NO3
InChI: InChI=1/C22H23NO3/c1-21(2)19(22(21,3)4)20(24)26-18(14-23)15-9-8-12-17(13-15)25-16-10-6-5-7-11-16/h5-13,18-19H,1-4H3
49 atoms
O  0.749722 1.499064 -0.400074
O  1.094106 3.698875 -0.554992
O  -1.253738 -3.020392 0.527339
N  -0.891754 2.457374 2.394929
C  3.887165 2.907526 -1.754089
C  4.126709 2.902529 -0.277238
C  2.921896 2.155126 -0.845773
C  3.462401 4.172552 -2.465312
C  4.739196 2.043105 -2.659188
C  5.217186 2.03419 0.31367
C  3.936845 4.159683 0.540585
C  1.536609 2.583561 -0.596586
C  -0.613614 1.745126 -0.109402
C  -1.392055 0.480974 -0.369245
C  -0.756447 2.159902 1.293591
C  -0.996073 -0.714138 0.217211
C  -2.514332 0.52208 -1.181316
C  -1.720238 -1.869277 -0.026027
C  -3.236327 -0.639935 -1.413341
C  -2.844888 -1.83914 -0.846263
C  -2.13683 -3.957704 0.986167
C  -1.867527 -5.286697 0.697319
C  -3.237857 -3.610844 1.759426
C  -2.708041 -6.274957 1.187106
C  -4.074175 -4.608506 2.234584
C  -3.816309 -5.94199 1.951029
H  3.028421 1.076109 -0.864961
H  2.914191 3.925429 -3.376196
H  2.831089 4.831156 -1.87924
H  4.349685 4.734752 -2.762993
H  4.222808 1.864973 -3.60378
H  5.682046 2.543101 -2.889354
H  4.976893 1.069573 -2.235366
H  6.185881 2.532238 0.239783
H  5.020054 1.854282 1.371533
H  5.308558 1.061629 -0.165635
H  4.872395 4.722146 0.560935
H  3.158497 4.822487 0.178685
H  3.687546 3.903409 1.571598
H  -1.005122 2.556141 -0.730973
H  -0.128505 -0.759608 0.863517
H  -2.826342 1.454068 -1.635116
H  -4.108626 -0.613139 -2.052234
H  -3.406236 -2.743459 -1.041247
H  -1.002647 -5.538604 0.097955
H  -3.438566 -2.573405 1.994824
H  -2.496046 -7.311828 0.962518
H  -4.930194 -4.337865 2.838297
H  -4.471768 -6.715436 2.327317
totalener: -1132.67512235 hartree
nucrepener: 2160.20876435 hartree
electener: -3292.88388670 hartree
oneelecener: -5829.04980899 hartree
twoeener: 2536.16592229 hartree
kineticenergy: 1127.72834654 hartree
xcener: -110.666411593392 hartree
chargesum: 0.0000000
charge: -0.278468 -0.382263 -0.297910 -0.003161 0.083275 0.078729 -0.118122 -0.272451 -0.255790 -0.255330 -0.272741 0.338112 0.341047 0.046469 -0.271493 -0.182946 -0.144880 0.173103 -0.116550 -0.142804 0.220994 -0.199757 -0.148119 -0.096165 -0.119523 -0.139049 0.075138 0.085664 0.105340 0.088052 0.089516 0.092919 0.077686 0.092350 0.092493 0.076302 0.087905 0.105704 0.093134 0.105980 0.122363 0.113681 0.129603 0.136468 0.126274 0.137281 0.125684 0.129377 0.126882
qa: -0.2785 -0.3823 -0.2979 -0.0032 0.0833 0.0787 -0.1181 -0.2725 -0.2558 -0.2553 -0.2727 0.3381 0.3410 0.0465 -0.2715 -0.1829 -0.1449 0.1731 -0.1166 -0.1428 0.2210 -0.1998 -0.1481 -0.0962 -0.1195 -0.1390 0.0751 0.0857 0.1053 0.0881 0.0895 0.0929 0.0777 0.0923 0.0925 0.0763 0.0879 0.1057 0.0931 0.1060 0.1224 0.1137 0.1296 0.1365 0.1263 0.1373 0.1257 0.1294 0.1269
va: 2.1527 2.1111 2.1051 3.1202 3.7236 3.7370 3.9372 3.9184 3.9067 3.9041 3.9247 4.1697 3.8224 3.7403 4.0039 4.0856 3.9831 3.9119 3.9759 3.9423 3.8201 4.0319 3.9352 3.9389 3.9465 3.9557 1.0307 1.0034 1.0181 0.9991 1.0062 1.0011 1.0100 1.0011 1.0061 1.0102 0.9985 1.0163 1.0032 1.0316 1.0318 1.0110 1.0018 1.0019 1.0131 1.0025 0.9989 0.9997 1.0000
dispcorr: -0.022651353 hartree
energy: -1132.697773702488
dipole: 26.63725 -26.42392 0.21334 11.69443 -12.81237 -1.11794 -9.59195 8.22589 -1.36606
magnitude: 1.77804 au
magnitude: 4.51942 debye
