program: Orca
programVersion: 5.0.2
elementType: O O O N C C C C C C C C C C C C C C C C C C C C C C H H H H H H H H H H H H H H H H H H H H H H H
charge: 0
multiplicity: 1
keywords: wb97x-d3
keywords: def2-TZVPP
keywords: def2/J RIJCOSX
keywords: DEFGRID2
keywords: scfconv7
keywords: smallprint printgap noloewdin
keywords: NOSOSCF
formula: C22H23NO3
InChI: InChI=1/C22H23NO3/c1-21(2)19(22(21,3)4)20(24)26-18(14-23)15-9-8-12-17(13-15)25-16-10-6-5-7-11-16/h5-13,18-19H,1-4H3
49 atoms
O  0.694143 1.77782 0.015521
O  1.62774 2.568138 -1.853384
O  -2.534794 -2.792047 -0.747151
N  -1.834036 3.862511 -0.733155
C  4.331785 2.233832 -0.275456
C  3.883163 3.624878 0.042986
C  2.897312 2.468241 0.190806
C  4.623969 1.824271 -1.701191
C  5.219943 1.482828 0.693758
C  4.316338 4.288425 1.333315
C  3.713572 4.65092 -1.054995
C  1.727029 2.302494 -0.6864
C  -0.525783 1.595611 -0.685646
C  -1.319187 0.524565 0.016048
C  -1.256239 2.86978 -0.718706
C  -1.566523 -0.667501 -0.643908
C  -1.775289 0.711995 1.315713
C  -2.283612 -1.677105 -0.012423
C  -2.482799 -0.301478 1.937458
C  -2.745267 -1.497427 1.284229
C  -2.686871 -4.002818 -0.130513
C  -3.784196 -4.772093 -0.484254
C  -1.747469 -4.482128 0.773675
C  -3.937479 -6.035739 0.066612
C  -1.918325 -5.742257 1.324159
C  -3.010896 -6.523512 0.97524
H  2.700763 2.167353 1.213902
H  3.993408 2.299392 -2.444663
H  5.662371 2.060453 -1.941436
H  4.501641 0.745677 -1.814343
H  6.266462 1.75441 0.541982
H  4.979623 1.667574 1.738677
H  5.132369 0.407881 0.528239
H  4.351159 3.61082 2.1839
H  5.307965 4.731098 1.221343
H  3.624856 5.09223 1.59061
H  4.660458 5.171724 -1.209942
H  3.396407 4.244832 -2.008766
H  2.974634 5.397976 -0.760751
H  -0.336863 1.301189 -1.721945
H  -1.212708 -0.826661 -1.655297
H  -1.590279 1.643558 1.834484
H  -2.849392 -0.160097 2.945273
H  -3.312352 -2.27347 1.781126
H  -4.503732 -4.382588 -1.192297
H  -0.887635 -3.880746 1.040159
H  -4.791517 -6.637832 -0.213741
H  -1.185446 -6.117664 2.025931
H  -3.135103 -7.507941 1.405331
totalener: -1132.67543325 hartree
nucrepener: 2151.71175733 hartree
electener: -3284.38719058 hartree
oneelecener: -5811.93774362 hartree
twoeener: 2527.55055304 hartree
kineticenergy: 1127.72152392 hartree
xcener: -110.664983416158 hartree
chargesum: -0.0000000
charge: -0.272046 -0.386386 -0.296605 -0.002439 0.085738 0.079801 -0.123841 -0.275706 -0.255792 -0.255597 -0.273364 0.344617 0.336537 0.058608 -0.276114 -0.180466 -0.182035 0.200199 -0.115756 -0.145897 0.226707 -0.194885 -0.159133 -0.098118 -0.115974 -0.136575 0.074558 0.106225 0.089018 0.085450 0.092775 0.077070 0.089387 0.076137 0.091981 0.093046 0.087352 0.106561 0.092642 0.104472 0.114771 0.123375 0.130244 0.135160 0.127854 0.133630 0.127279 0.128115 0.127420
qa: -0.2720 -0.3864 -0.2966 -0.0024 0.0857 0.0798 -0.1238 -0.2757 -0.2558 -0.2556 -0.2734 0.3446 0.3365 0.0586 -0.2761 -0.1805 -0.1820 0.2002 -0.1158 -0.1459 0.2267 -0.1949 -0.1591 -0.0981 -0.1160 -0.1366 0.0746 0.1062 0.0890 0.0854 0.0928 0.0771 0.0894 0.0761 0.0920 0.0930 0.0874 0.1066 0.0926 0.1045 0.1148 0.1234 0.1302 0.1352 0.1279 0.1336 0.1273 0.1281 0.1274
va: 2.1538 2.1058 2.1065 3.1199 3.7210 3.7338 3.9436 3.9205 3.9056 3.9050 3.9227 4.1641 3.8133 3.7298 4.0187 4.0380 4.0529 3.9252 3.9611 3.9347 3.8143 4.0354 3.9561 3.9361 3.9449 3.9548 1.0315 1.0175 0.9995 1.0032 1.0012 1.0102 1.0060 1.0099 1.0013 1.0059 0.9986 1.0164 1.0035 1.0339 1.0226 1.0170 1.0008 1.0036 1.0125 1.0029 0.9989 0.9997 0.9999
dispcorr: -0.022506762 hartree
energy: -1132.697940009303
dipole: 31.58583 -30.64834 0.93750 9.65690 -11.28732 -1.63042 4.96203 -3.83095 1.13108
magnitude: 2.19465 au
magnitude: 5.57837 debye
