program: Orca
programVersion: 5.0.2
elementType: O O O N C C C C C C C C C C C C C C C C C C C C C C H H H H H H H H H H H H H H H H H H H H H H H
charge: 0
multiplicity: 1
keywords: wb97x-d3
keywords: def2-TZVPP
keywords: def2/J RIJCOSX
keywords: DEFGRID2
keywords: scfconv7
keywords: smallprint printgap noloewdin
keywords: NOSOSCF
formula: C22H23NO3
InChI: InChI=1/C22H23NO3/c1-21(2)19(22(21,3)4)20(24)26-18(14-23)15-9-8-12-17(13-15)25-16-10-6-5-7-11-16/h5-13,18-19H,1-4H3
49 atoms
O  0.656041 1.77205 -0.007236
O  1.651434 2.488359 -1.874663
O  -2.631265 -2.729372 -0.744648
N  -1.776798 3.948827 -0.800111
C  4.314731 2.106763 -0.233676
C  3.897232 3.514563 0.052723
C  2.877576 2.386865 0.195932
C  4.628522 1.66909 -1.646374
C  5.158375 1.345225 0.766472
C  4.313684 4.18951 1.342404
C  3.78246 4.524798 -1.06654
C  1.719787 2.243068 -0.701045
C  -0.561636 1.631776 -0.721742
C  -1.399981 0.59322 -0.023961
C  -1.239963 2.933618 -0.770671
C  -1.636433 -0.613341 -0.662378
C  -1.89942 0.81604 1.253589
C  -2.383671 -1.599497 -0.031339
C  -2.636435 -0.1763 1.876893
C  -2.886168 -1.385729 1.244759
C  -2.670426 -3.945463 -0.122854
C  -3.666893 -4.826856 -0.513642
C  -1.718981 -4.325202 0.81588
C  -3.706364 -6.099717 0.034357
C  -1.776621 -5.597751 1.362252
C  -2.766288 -6.490098 0.975977
H  2.651577 2.10895 1.219427
H  4.492437 0.590621 -1.743871
H  4.019058 2.140459 -2.409634
H  5.674738 1.886246 -1.870183
H  5.032404 0.270873 0.623299
H  6.216684 1.573869 0.626463
H  4.90846 1.562666 1.802872
H  3.628015 5.006052 1.574016
H  4.321229 3.523218 2.202537
H  5.313446 4.617129 1.245361
H  4.749249 5.01029 -1.213217
H  3.469423 4.111536 -2.01864
H  3.064121 5.301925 -0.800373
H  -0.371957 1.32457 -1.754199
H  -1.24972 -0.800977 -1.656654
H  -1.724925 1.75902 1.755265
H  -3.035546 -0.006271 2.867787
H  -3.47522 -2.147094 1.73921
H  -4.397603 -4.514336 -1.247857
H  -0.935432 -3.639556 1.112163
H  -4.482775 -6.786876 -0.274709
H  -1.033437 -5.895029 2.090268
H  -2.801758 -7.482637 1.403912
totalener: -1132.67527739 hartree
nucrepener: 2155.02362378 hartree
electener: -3287.69890116 hartree
oneelecener: -5818.52677337 hartree
twoeener: 2530.82787221 hartree
kineticenergy: 1127.72428994 hartree
xcener: -110.665319670165 hartree
chargesum: -0.0000000
charge: -0.271028 -0.386472 -0.297734 -0.002505 0.086916 0.078848 -0.127476 -0.276048 -0.255276 -0.254832 -0.273787 0.348258 0.334871 0.059666 -0.276664 -0.178882 -0.179623 0.191242 -0.111456 -0.143091 0.234097 -0.204610 -0.157505 -0.093002 -0.117506 -0.140728 0.074322 0.085059 0.106435 0.089239 0.089552 0.092507 0.076989 0.093313 0.076022 0.091707 0.087746 0.106446 0.092605 0.105511 0.115412 0.123450 0.130993 0.136093 0.127009 0.132836 0.126677 0.127569 0.126838
qa: -0.2710 -0.3865 -0.2977 -0.0025 0.0869 0.0788 -0.1275 -0.2760 -0.2553 -0.2548 -0.2738 0.3483 0.3349 0.0597 -0.2767 -0.1789 -0.1796 0.1912 -0.1115 -0.1431 0.2341 -0.2046 -0.1575 -0.0930 -0.1175 -0.1407 0.0743 0.0851 0.1064 0.0892 0.0896 0.0925 0.0770 0.0933 0.0760 0.0917 0.0877 0.1064 0.0926 0.1055 0.1154 0.1234 0.1310 0.1361 0.1270 0.1328 0.1267 0.1276 0.1268
va: 2.1518 2.1057 2.1047 3.1199 3.7190 3.7349 3.9467 3.9209 3.9051 3.9043 3.9236 4.1611 3.8121 3.7219 4.0213 4.0423 4.0530 3.9284 3.9528 3.9465 3.8089 4.0355 3.9430 3.9365 3.9499 3.9593 1.0320 1.0035 1.0175 0.9994 1.0059 1.0013 1.0102 1.0057 1.0100 1.0014 0.9987 1.0163 1.0035 1.0334 1.0222 1.0166 1.0006 1.0025 1.0133 1.0039 0.9988 0.9999 1.0001
dispcorr: -0.022508925 hartree
energy: -1132.697786311301
dipole: 31.84264 -30.92596 0.91669 8.71989 -10.30627 -1.58638 5.32189 -4.16347 1.15842
magnitude: 2.16769 au
magnitude: 5.50983 debye
