program: Orca
programVersion: 5.0.2
elementType: O O O N C C C C C C C C C C C C C C C C C C C C C C H H H H H H H H H H H H H H H H H H H H H H H
charge: 0
multiplicity: 1
keywords: wb97x-d3
keywords: def2-TZVPP
keywords: def2/J RIJCOSX
keywords: DEFGRID2
keywords: scfconv7
keywords: smallprint printgap noloewdin
keywords: NOSOSCF
formula: C22H23NO3
InChI: InChI=1/C22H23NO3/c1-21(2)19(22(21,3)4)20(24)26-18(14-23)15-9-8-12-17(13-15)25-16-10-6-5-7-11-16/h5-13,18-19H,1-4H3
49 atoms
O  0.260365 2.592632 0.2230
O  1.273188 1.497282 -1.442987
O  -2.013108 -2.352726 -0.994309
N  -2.505287 4.398581 0.166866
C  3.821087 1.60961 0.377907
C  3.852805 2.932016 -0.321512
C  2.561166 2.467045 0.346557
C  3.90645 0.320776 -0.408207
C  4.47503 1.455344 1.734861
C  4.533033 4.119316 0.325507
C  3.962576 3.00171 -1.82778
C  1.350559 2.110861 -0.412187
C  -1.004949 2.327242 -0.369916
C  -1.59794 1.044789 0.159924
C  -1.839708 3.489975 -0.058152
C  -1.542988 -0.095851 -0.625594
C  -2.145133 0.989684 1.436902
C  -2.0560 -1.294102 -0.143696
C  -2.650208 -0.209787 1.907073
C  -2.615737 -1.35579 1.126058
C  -2.013811 -3.628283 -0.501929
C  -2.961906 -4.512364 -0.991958
C  -1.062048 -4.049344 0.418144
C  -2.953916 -5.830405 -0.559828
C  -1.07158 -5.366007 0.849632
C  -2.015115 -6.261094 0.364974
H  2.33293 2.971054 1.279279
H  4.955594 0.051978 -0.546424
H  3.432559 -0.490334 0.147285
H  3.439225 0.354519 -1.385953
H  4.344589 2.319147 2.383505
H  4.054435 0.594771 2.257737
H  5.547484 1.282052 1.625579
H  5.606585 4.10043 0.127722
H  4.138892 5.049087 -0.087688
H  4.397046 4.165481 1.403993
H  3.456857 2.199464 -2.354078
H  3.545977 3.942328 -2.192132
H  5.015435 2.979286 -2.115551
H  -0.913515 2.268934 -1.458605
H  -1.100088 -0.066932 -1.612876
H  -2.193792 1.877126 2.054835
H  -3.089887 -0.257053 2.894248
H  -3.029653 -2.280951 1.504732
H  -3.692888 -4.16686 -1.711025
H  -0.317354 -3.356367 0.788675
H  -3.692079 -6.520829 -0.945885
H  -0.329335 -5.695542 1.564558
H  -2.014482 -7.288292 0.703418
totalener: -1132.67604665 hartree
nucrepener: 2197.64613007 hartree
electener: -3330.32217672 hartree
oneelecener: -5903.83669240 hartree
twoeener: 2573.51451569 hartree
kineticenergy: 1127.72267733 hartree
xcener: -110.666352183721 hartree
chargesum: -0.0000000
charge: -0.262375 -0.403499 -0.293979 -0.007280 0.086192 0.080814 -0.129889 -0.273592 -0.256294 -0.254690 -0.276891 0.367329 0.317745 -0.003305 -0.253361 -0.152837 -0.166355 0.205268 -0.122729 -0.148779 0.221273 -0.187994 -0.157910 -0.101870 -0.116272 -0.133408 0.075713 0.088658 0.086270 0.104916 0.078432 0.089348 0.092463 0.092613 0.091688 0.077363 0.104509 0.088209 0.090034 0.116773 0.120449 0.120927 0.129822 0.133315 0.126793 0.134629 0.127127 0.127433 0.127202
qa: -0.2624 -0.4035 -0.2940 -0.0073 0.0862 0.0808 -0.1299 -0.2736 -0.2563 -0.2547 -0.2769 0.3673 0.3177 -0.0033 -0.2534 -0.1528 -0.1664 0.2053 -0.1227 -0.1488 0.2213 -0.1880 -0.1579 -0.1019 -0.1163 -0.1334 0.0757 0.0887 0.0863 0.1049 0.0784 0.0893 0.0925 0.0926 0.0917 0.0774 0.1045 0.0882 0.0900 0.1168 0.1204 0.1209 0.1298 0.1333 0.1268 0.1346 0.1271 0.1274 0.1272
va: 2.1284 2.0875 2.1101 3.1188 3.7188 3.7301 3.9423 3.9212 3.9070 3.9067 3.9236 4.1480 3.8243 3.7057 4.0205 4.0253 4.0417 3.9046 3.9723 3.9351 3.8239 4.0349 3.9595 3.9373 3.9407 3.9524 1.0339 0.9991 1.0034 1.0175 1.0104 1.0060 1.0010 1.0009 1.0060 1.0104 1.0165 1.0034 0.9992 1.0247 1.0339 1.0163 1.0015 1.0049 1.0125 1.0025 0.9991 0.9999 0.9999
dispcorr: -0.023185326 hartree
energy: -1132.699231970847
dipole: 31.61773 -30.48982 1.12791 3.05453 -4.42174 -1.36721 3.70282 -3.05964 0.64318
magnitude: 1.88550 au
magnitude: 4.79257 debye
