program: Orca
programVersion: 5.0.2
elementType: O O O N C C C C C C C C C C C C C C C C C C C C C C H H H H H H H H H H H H H H H H H H H H H H H
charge: 0
multiplicity: 1
keywords: wb97x-d3
keywords: def2-TZVPP
keywords: def2/J RIJCOSX
keywords: DEFGRID2
keywords: scfconv7
keywords: smallprint printgap noloewdin
keywords: NOSOSCF
formula: C22H23NO3
InChI: InChI=1/C22H23NO3/c1-21(2)19(22(21,3)4)20(24)26-18(14-23)15-9-8-12-17(13-15)25-16-10-6-5-7-11-16/h5-13,18-19H,1-4H3
49 atoms
O  0.581036 2.341965 0.218317
O  1.639153 1.727758 -1.656383
O  -1.811127 -2.900078 -0.71052
N  -2.533507 3.454195 0.387196
C  4.275524 2.348394 -0.085972
C  3.85778 3.708053 -0.551932
C  2.838461 2.802455 0.135804
C  4.607739 1.258891 -1.080668
C  5.113257 2.202326 1.167419
C  4.269437 4.940259 0.225207
C  3.737952 4.01286 -2.02783
C  1.679687 2.2254 -0.564946
C  -0.630116 1.782746 -0.258998
C  -0.884014 0.430082 0.361931
C  -1.689089 2.726838 0.109597
C  -1.231715 -0.64196 -0.443312
C  -0.795557 0.27439 1.740383
C  -1.499576 -1.878318 0.13167
C  -1.051705 -0.964611 2.300238
C  -1.403986 -2.045857 1.506613
C  -2.71194 -3.845388 -0.30121
C  -3.942362 -3.487797 0.236577
C  -2.380814 -5.179037 -0.481361
C  -4.837366 -4.480063 0.602085
C  -3.290162 -6.162276 -0.119108
C  -4.516788 -5.819261 0.428194
H  2.605948 3.089458 1.155266
H  5.671727 1.305103 -1.321146
H  4.415144 0.277835 -0.643447
H  4.053461 1.30944 -2.01108
H  5.030064 1.186218 1.556249
H  6.167106 2.384789 0.948298
H  4.820101 2.876862 1.969404
H  5.26625 5.267984 -0.076577
H  3.578914 5.760602 0.023427
H  4.283814 4.791216 1.30287
H  3.042089 4.83899 -2.184856
H  4.708811 4.327162 -2.415812
H  3.391475 3.181148 -2.632399
H  -0.615436 1.696265 -1.349805
H  -1.297132 -0.531176 -1.518771
H  -0.53323 1.112639 2.372138
H  -0.979589 -1.096487 3.371434
H  -1.602755 -3.009131 1.957741
H  -4.200535 -2.444492 0.366955
H  -1.419955 -5.439056 -0.905565
H  -5.795574 -4.201443 1.020304
H  -3.031813 -7.203276 -0.261071
H  -5.220601 -6.588834 0.714435
totalener: -1132.67470889 hartree
nucrepener: 2165.07807732 hartree
electener: -3297.75278622 hartree
oneelecener: -5838.69522543 hartree
twoeener: 2540.94243921 hartree
kineticenergy: 1127.72514268 hartree
xcener: -110.665817652504 hartree
chargesum: -0.0000000
charge: -0.278617 -0.389131 -0.297904 -0.004159 0.085269 0.081823 -0.124120 -0.270241 -0.257089 -0.254113 -0.278408 0.342290 0.320518 0.038120 -0.251925 -0.161054 -0.178169 0.175114 -0.117868 -0.127030 0.210597 -0.141244 -0.194320 -0.121868 -0.099700 -0.134648 0.073734 0.087118 0.088875 0.104185 0.090323 0.092992 0.077001 0.092051 0.092548 0.077034 0.089827 0.090558 0.103860 0.116501 0.115607 0.124228 0.129656 0.135109 0.135986 0.127701 0.129430 0.126566 0.126987
qa: -0.2786 -0.3891 -0.2979 -0.0042 0.0853 0.0818 -0.1241 -0.2702 -0.2571 -0.2541 -0.2784 0.3423 0.3205 0.0381 -0.2519 -0.1611 -0.1782 0.1751 -0.1179 -0.1270 0.2106 -0.1412 -0.1943 -0.1219 -0.0997 -0.1346 0.0737 0.0871 0.0889 0.1042 0.0903 0.0930 0.0770 0.0921 0.0925 0.0770 0.0898 0.0906 0.1039 0.1165 0.1156 0.1242 0.1297 0.1351 0.1360 0.1277 0.1294 0.1266 0.1270
va: 2.1155 2.1078 2.1030 3.1195 3.7181 3.7398 3.9259 3.9200 3.9092 3.9059 3.9248 4.1810 3.8061 3.7136 4.0352 4.0476 4.0251 3.9252 3.9629 3.9227 3.8293 3.9397 4.0285 3.9496 3.9366 3.9531 1.0330 0.9988 1.0033 1.0169 1.0059 1.0010 1.0100 1.0012 1.0061 1.0101 1.0031 0.9992 1.0165 1.0360 1.0234 1.0188 1.0011 1.0026 1.0024 1.0122 0.9996 0.9989 0.9999
dispcorr: -0.022888315 hartree
energy: -1132.697597209895
dipole: 30.46572 -29.33778 1.12794 11.47968 -12.43562 -0.95594 0.76885 -0.15392 0.61494
magnitude: 1.60132 au
magnitude: 4.07023 debye
