program: Gaussian 09
title: 000074655
version: EM64L-G09RevD.01
frameworkgroup: C1[X(C10H10O4)]
method: RPBEPBE
basis: SDD
operation: Freq
keyword: #pfreq=noraman
keyword: PBEPBE/SDD
title: #p freq=noraman PBEPBE/SDD
converged: YES YES NO NO
title: Mulliken charges:
elementType: O O O O C C C C C C C C C C H H H H H H H H H H
charge: -0.239571 -0.233527 -0.422697 -0.187113 0.299433 0.355921 -0.314213 -0.358535 -0.382265 -0.340674 0.123308 -0.342174 -0.791066 0.163462 0.246072 0.278722 0.261785 0.249279 0.253269 0.253104 0.236847 0.237104 0.260769 0.392760
chargesum: 0.00000
title: Mulliken charges with hydrogens summed into heavy atoms:
elementType: O O O O C C C C C C C C C C
charge: -0.239571 -0.233527 -0.029937 -0.187113 0.299433 0.355921 -0.068141 -0.079813 -0.120480 -0.091395 0.123308 0.164198 -0.056346 0.163462
polarizability: 1.98602454e+02 1.62617079e+00 1.21589729e+02 -1.14656771e-01 3.09482201e-02 5.76471235e+01
1716.lowfreq: -5.4939 -4.4274 -0.0007 0.0003 0.0008 2.9747 26.3002 34.2013 68.7848
frequency: 26.2987 34.0073 68.7834 78.8281 109.7500 137.0159 156.3822 179.5876 211.2878 282.1406 303.8772 376.1361 414.4670 451.3840 491.4926 497.0129 511.7187 544.3002 588.6701 589.8859 628.6659 628.7118 693.7327 737.5826 810.5825 827.6618 841.6441 879.2452 946.6188 966.9492 985.1814 998.9653 1004.6632 1005.3090 1026.4892 1055.1495 1073.6732 1122.0795 1177.1300 1202.3490 1235.9597 1258.7899 1278.3489 1304.7058 1363.8250 1370.8154 1384.9591 1425.8765 1447.9890 1450.2888 1463.6953 1498.0908 1566.1361 1591.7483 1622.9092 1706.3633 2968.4939 2984.5724 3026.5273 3068.9515 3125.2630 3146.5814 3150.5199 3166.0010 3174.8292 3527.8970
redmass: 11.3327 5.2173 3.8256 6.6815 5.9727 2.6945 1.0359 7.1632 5.1340 5.9348 7.1729 4.3374 2.9551 5.4572 3.0141 4.6733 1.7797 5.0364 4.4854 2.3317 6.1367 1.5419 5.5423 3.5612 6.8282 1.2551 1.5936 4.0823 2.1746 1.3416 1.3654 3.1191 1.8846 4.6530 1.8226 2.7600 2.4088 1.3116 1.2101 1.0771 3.1242 1.7908 3.4030 1.3468 2.0438 1.4758 2.4678 4.0798 1.1094 1.0994 1.0498 2.5108 6.9585 7.0543 6.8376 9.3954 1.0555 1.0375 1.1041 1.0969 1.0990 1.0877 1.0879 1.0957 1.0968 1.0643
irintensity: 1.3602 0.9208 6.8059 3.9517 0.4085 9.6680 0.2677 0.9453 2.8045 1.5860 0.3472 4.1120 0.0453 19.4778 2.2722 3.0074 46.1136 1.5166 66.9063 11.4421 6.7292 134.5741 4.2442 0.4536 8.8699 2.2026 87.5203 0.9791 48.9084 0.0149 1.6921 6.6350 4.7361 340.6884 1.3489 132.8412 1.3479 14.1423 150.2067 0.5471 225.5842 2.2252 266.2829 25.9189 12.7721 106.9336 5.4387 4.2168 79.0213 13.3718 20.6745 28.6302 60.0583 241.2273 108.0667 213.3908 42.4042 3.6910 13.9202 13.2044 17.5635 2.2470 7.7573 15.3282 3.7418 40.2910
temp: 298.150 k
press: 1.00000 atm
elementType: 8 8 8 8 6 6 6 6 6 6 6 6 6 6 1 1 1 1 1 1 1 1 1 1
symmnumber: 1
zpe: 472378.7 jmol-1
zpe.correction: 0.179920 hartree
zpe.thermalcorrener: 0.193454 hartree
zpe.thermalcorrenthalpy: 0.194398 hartree
zpe.thermalcorrgfe: 0.137761 hartree
zpe.sumelectzpe: -686.926113 hartree
zpe.sumelectthermal: -686.912579 hartree
zpe.sumelectthermalent: -686.911635 hartree
zpe.sumelectthermalfe: -686.968272 hartree
dipole: 2.6315 0.1464 0.0195
dipole: 2.6357
quadrupole: -78.4054 -83.9006 -82.0929
quadrupole: -24.1708 0.0327 0.0505
quadrupole: 3.0609 -2.4343 -0.6266 -24.1708 0.0327 0.0505
hfenergy: -687.1060324 hartree
pointgroup: C01 [X(C10H10O4)]
dipole: 1.0362228 0.0384853 0.0055063 debye
dipolederiv: -2.0800054 0.1480685 -0.0135047 0.1200907 -0.2661987 0.0000756 -0.0087861 0.0008144 -0.2660659 -0.9797486 -0.1390454 0.0119148 -0.4944657 -0.7790815 0.0362346 0.0409714 0.0363591 -0.3255244 -0.9645734 0.5421489 -0.0482863 0.5429241 -0.8087475 0.0346923 -0.0498208 0.0351348 -0.4415135 -0.731347 -0.2164687 0.0169401 0.0183577 -0.8923789 0.0522036 -0.0043272 0.0505702 -0.2934642 -1.1129816 0.0062167 0.0007539 0.0316668 -0.2249451 0.0147857 -0.0002411 0.0148995 -0.0380115 1.8654443 -0.0121148 0.0017551 0.2601508 0.1605306 -0.002018 -0.0231769 -0.0029596 0.1205484 0.3747342 0.0088836 -0.0013761 0.1965969 0.1117165 -0.0190056 -0.016116 -0.0189941 -0.1255947 0.3215115 0.0064469 -0.0008004 -0.1464261 0.0901692 -0.0137983 0.0111944 -0.0141599 -0.0836929 -0.6044969 0.0427954 -0.0036476 0.363702 0.0179372 -0.0157157 -0.0302536 -0.0155041 -0.1711074 -0.4775069 -0.0660457 0.0049109 -0.4532805 -0.0822516 -0.0101256 0.0368972 -0.009648 -0.207995 1.9880535 -0.0004532 -0.0032625 0.1488449 0.9010093 -0.0607937 -0.0167117 -0.061008 0.1261085 0.5293221 -0.2272234 0.0179122 -0.8933879 0.2275746 0.0116167 0.0736435 0.0125135 0.3827266 -0.2664067 0.202914 -0.0151115 0.3551861 -0.3229666 0.0281033 -0.0259949 0.0277667 0.0508471 1.6276285 -0.174267 0.021355 -0.2448205 1.4630806 -0.109878 0.0300128 -0.1092962 0.2139323 0.0378059 0.0990569 -0.0078952 0.0979704 -0.0166231 0.0124034 -0.0075621 0.0125132 0.1395554 0.1110867 -0.0622053 0.0049632 -0.0158994 0.0123699 0.0109894 0.0011832 0.0111725 0.1487934 0.0644725 -0.0614149 0.005119 -0.0648398 -0.0048698 0.0142582 0.0050923 0.0141841 0.1710581 -0.0045046 0.0983097 -0.0075685 0.1219749 -0.0019169 0.0136437 -0.0094639 0.0134932 0.1680501 0.0156651 -0.0114911 0.0262773 0.154902 0.0164787 0.0684201 -0.0314785 0.0791853 -0.0360544 0.0150206 -0.0146532 -0.0232187 0.1588147 -0.0094983 -0.0726258 0.005471 -0.0840681 -0.0106379 0.0828243 -0.0191351 0.0755498 -0.0068385 0.0521512 0.0763376 0.0389841 0.0889366 -0.037945 0.0825064 -0.030089 -0.0716139 -0.0126194 0.0258141 -0.0856116 -0.0378291 -0.0981232 -0.0113353 -0.1077968 -0.0148668 0.0010323 -0.0874973 0.0848648 0.0028378 0.0065236 0.0030149 0.1211609 0.2132924 -0.105367 0.0078018 -0.1511067 0.2457817 0.0129703 0.0117884 0.0132031 0.4061613 unknown
polarizability: 198.6365344|0.160948|121.1371148|0.0046879|-5.1555392|58.0656576 unknown
InChI: InChI=1S/C10H10O4/c1-7(11)8-2-4-9(5-3-8)14-6-10(12)13/h2-5,12H,6H2,1H3
charge 0 multiplicity 1
24 atoms
O  1.866687 0.54458 -0.103179
O  -4.301305 -1.396839 0.059549
O  5.069386 -1.149296 0.058914
O  4.578052 1.122387 -0.138984
C  -2.329948 -0.018123 -0.054048
C  0.490488 0.277348 -0.08099
C  -1.734886 1.271758 -0.1584
C  -1.479293 -1.151485 0.035488
C  -0.339515 1.422871 -0.172454
C  -0.078854 -1.019384 0.02332
C  -3.814029 -0.229796 -0.03398
C  2.771272 -0.589157 -0.003262
C  -4.731951 0.98627 -0.126901
C  4.196408 -0.053949 -0.040395
H  -2.363269 2.165428 -0.228744
H  -1.949082 -2.137707 0.115177
H  0.133911 2.405668 -0.251951
H  0.547027 -1.914069 0.093861
H  2.625526 -1.146987 0.943732
H  2.635651 -1.297355 -0.845539
H  -4.556819 1.548041 -1.063429
H  -4.556788 1.68206 0.714909
H  -5.778447 0.647242 -0.10109
H  6.011678 -0.830305 0.037494
