program: Orca
programVersion: 5.0.2
elementType: O O O N C C C C C C C C C C C C C C C C C C C C C C H H H H H H H H H H H H H H H H H H H H H H H
charge: 0
multiplicity: 1
keywords: wb97x-d3
keywords: def2-TZVPP
keywords: def2/J RIJCOSX
keywords: DEFGRID2
keywords: scfconv7
keywords: smallprint printgap noloewdin
keywords: NOSOSCF
formula: C22H23NO3
InChI: InChI=1/C22H23NO3/c1-21(2)19(22(21,3)4)20(24)26-18(14-23)15-9-8-12-17(13-15)25-16-10-6-5-7-11-16/h5-13,18-19H,1-4H3
49 atoms
O  0.141099 2.326512 -0.655758
O  1.589965 0.631145 -0.755323
O  -1.546227 -2.830168 1.494641
N  -2.939583 2.811209 -1.763619
C  3.438404 2.619154 0.861824
C  3.812131 2.834988 -0.571484
C  2.341269 2.846918 -0.176896
C  3.61436 1.263883 1.508504
C  3.624333 3.729526 1.873729
C  4.380848 4.16822 -1.010365
C  4.391394 1.707361 -1.396416
C  1.381387 1.796393 -0.5534
C  -0.908083 1.40596 -0.909679
C  -1.287206 0.628492 0.329299
C  -2.036363 2.210611 -1.386092
C  -1.251171 -0.755865 0.3032
C  -1.645154 1.30493 1.489005
C  -1.594049 -1.472521 1.443992
C  -1.966415 0.579868 2.623967
C  -1.949114 -0.805873 2.607786
C  -1.834689 -3.554656 0.370358
C  -0.932457 -4.529025 -0.025452
C  -3.017847 -3.357252 -0.330127
C  -1.222053 -5.317617 -1.129576
C  -3.290469 -4.145373 -1.436729
C  -2.396109 -5.126412 -1.841569
H  1.887993 3.831539 -0.140876
H  3.461808 0.422784 0.840853
H  4.622399 1.186876 1.920493
H  2.913441 1.148836 2.337121
H  2.969411 3.568806 2.731723
H  4.651816 3.743383 2.24293
H  3.401565 4.719343 1.480558
H  4.254519 4.293556 -2.086904
H  3.90846 5.023233 -0.530894
H  5.450459 4.217825 -0.797178
H  5.476925 1.69689 -1.279663
H  4.018176 0.721924 -1.1412
H  4.179832 1.868679 -2.454792
H  -0.631705 0.711822 -1.710216
H  -0.938814 -1.272652 -0.595553
H  -1.67784 2.38668 1.506559
H  -2.247099 1.097081 3.531602
H  -2.207636 -1.375307 3.490694
H  -0.016106 -4.667167 0.533008
H  -3.721694 -2.598754 -0.011351
H  -0.519037 -6.080424 -1.43698
H  -4.212844 -3.994477 -1.981771
H  -2.616135 -5.740349 -2.704311
totalener: -1132.67509044 hartree
nucrepener: 2229.64627740 hartree
electener: -3362.32136784 hartree
oneelecener: -5967.94562282 hartree
twoeener: 2605.62425498 hartree
kineticenergy: 1127.72575553 hartree
xcener: -110.666318408052 hartree
chargesum: -0.0000000
charge: -0.267547 -0.388141 -0.298541 -0.003930 0.077741 0.089929 -0.119004 -0.274231 -0.255516 -0.256534 -0.272460 0.336984 0.317833 0.009803 -0.254972 -0.088073 -0.195620 0.186991 -0.095546 -0.187856 0.213429 -0.191145 -0.147711 -0.098258 -0.118621 -0.135702 0.076545 0.104697 0.090325 0.089467 0.090035 0.092637 0.077907 0.090751 0.077385 0.093130 0.087303 0.104567 0.087066 0.114264 0.115304 0.123460 0.128264 0.129197 0.126605 0.135073 0.126347 0.129483 0.126886
qa: -0.2675 -0.3881 -0.2985 -0.0039 0.0777 0.0899 -0.1190 -0.2742 -0.2555 -0.2565 -0.2725 0.3370 0.3178 0.0098 -0.2550 -0.0881 -0.1956 0.1870 -0.0955 -0.1879 0.2134 -0.1911 -0.1477 -0.0983 -0.1186 -0.1357 0.0765 0.1047 0.0903 0.0895 0.0900 0.0926 0.0779 0.0908 0.0774 0.0931 0.0873 0.1046 0.0871 0.1143 0.1153 0.1235 0.1283 0.1292 0.1266 0.1351 0.1263 0.1295 0.1269
va: 2.1295 2.1099 2.1075 3.1233 3.7408 3.7252 3.9376 3.9235 3.9050 3.9066 3.9181 4.1682 3.8534 3.6548 4.0195 3.9035 4.0268 3.8881 3.9463 4.0292 3.8351 4.0344 3.9548 3.9344 3.9491 3.9536 1.0331 1.0167 0.9992 1.0032 1.0061 1.0013 1.0103 1.0061 1.0099 1.0008 0.9990 1.0178 1.0038 1.0221 1.0207 1.0175 0.9991 1.0111 1.0127 1.0029 0.9990 0.9995 1.0000
dispcorr: -0.023849445 hartree
energy: -1132.698939884836
dipole: 29.50557 -28.29178 1.21379 11.97526 -12.28005 -0.30479 2.75107 -2.19316 0.55791
magnitude: 1.37020 au
magnitude: 3.48278 debye
