program: Orca
programVersion: 5.0.2
elementType: O O O N C C C C C C C C C C C C C C C C C C C C C C H H H H H H H H H H H H H H H H H H H H H H H
charge: 0
multiplicity: 1
keywords: wb97x-d3
keywords: def2-TZVPP
keywords: def2/J RIJCOSX
keywords: DEFGRID2
keywords: scfconv7
keywords: smallprint printgap noloewdin
keywords: NOSOSCF
formula: C22H23NO3
InChI: InChI=1/C22H23NO3/c1-21(2)19(22(21,3)4)20(24)26-18(14-23)15-9-8-12-17(13-15)25-16-10-6-5-7-11-16/h5-13,18-19H,1-4H3
49 atoms
O  0.635043 2.437028 0.481184
O  1.458825 1.591578 -1.415482
O  -1.920609 -2.668187 -0.740879
N  -2.412977 3.489816 1.247767
C  4.281176 2.281104 -0.281125
C  3.81291 3.631251 -0.728614
C  2.895881 2.758063 0.12787
C  4.467721 1.162121 -1.282036
C  5.285966 2.160155 0.845247
C  4.338565 4.885562 -0.064937
C  3.484781 3.88401 -2.182712
C  1.641544 2.185445 -0.388497
C  -0.640027 1.923268 0.136241
C  -0.821411 0.501829 0.611966
C  -1.618995 2.808839 0.773217
C  -1.28909 -0.460294 -0.26721
C  -0.544478 0.172203 1.933233
C  -1.490982 -1.760832 0.176798
C  -0.736578 -1.129905 2.360897
C  -1.209799 -2.102385 1.493005
C  -2.771656 -3.665476 -0.352703
C  -3.904822 -3.401547 0.406901
C  -2.496435 -4.952872 -0.786955
C  -4.757996 -4.442504 0.736108
C  -3.365371 -5.983287 -0.459713
C  -4.49366 -5.735603 0.307021
H  2.810461 3.085416 1.158343
H  5.484323 1.203189 -1.678214
H  4.346772 0.194191 -0.793213
H  3.781169 1.185643 -2.1205
H  5.219803 1.16976 1.298833
H  6.303021 2.281342 0.466974
H  5.140858 2.887455 1.641796
H  5.271312 5.20386 -0.534824
H  3.62013 5.699416 -0.175898
H  4.529105 4.768863 0.999854
H  3.014793 3.046816 -2.688844
H  2.810512 4.737755 -2.272232
H  4.397983 4.133078 -2.726849
H  -0.798959 1.972474 -0.945798
H  -1.495969 -0.214095 -1.301293
H  -0.186006 0.924373 2.623678
H  -0.517689 -1.396906 3.38599
H  -1.355786 -3.116653 1.840743
H  -4.122178 -2.393024 0.735085
H  -1.61137 -5.138554 -1.381035
H  -5.640623 -4.237008 1.327284
H  -3.151222 -6.987499 -0.800717
H  -5.166006 -6.542551 0.56461
totalener: -1132.67488901 hartree
nucrepener: 2173.15799105 hartree
electener: -3305.83288007 hartree
oneelecener: -5854.90029482 hartree
twoeener: 2549.06741475 hartree
kineticenergy: 1127.72427326 hartree
xcener: -110.665858892257 hartree
chargesum: 0.0000000
charge: -0.274429 -0.386405 -0.297207 -0.004239 0.086146 0.079924 -0.116563 -0.268026 -0.257687 -0.253455 -0.282297 0.334700 0.315225 0.039937 -0.249506 -0.157117 -0.180498 0.177787 -0.115485 -0.132442 0.218156 -0.146707 -0.197869 -0.120492 -0.097635 -0.136797 0.074550 0.086276 0.088811 0.103890 0.090866 0.092121 0.077018 0.092299 0.092536 0.077293 0.102604 0.089434 0.093031 0.116621 0.111693 0.124754 0.129175 0.135128 0.135656 0.127373 0.128973 0.126174 0.126706
qa: -0.2744 -0.3864 -0.2972 -0.0042 0.0861 0.0799 -0.1166 -0.2680 -0.2577 -0.2535 -0.2823 0.3347 0.3152 0.0399 -0.2495 -0.1571 -0.1805 0.1778 -0.1155 -0.1324 0.2182 -0.1467 -0.1979 -0.1205 -0.0976 -0.1368 0.0746 0.0863 0.0888 0.1039 0.0909 0.0921 0.0770 0.0923 0.0925 0.0773 0.1026 0.0894 0.0930 0.1166 0.1117 0.1248 0.1292 0.1351 0.1357 0.1274 0.1290 0.1262 0.1267
va: 2.1191 2.1099 2.1049 3.1224 3.7185 3.7501 3.9299 3.9170 3.9087 3.9034 3.9255 4.1815 3.8344 3.6724 4.0201 4.0623 4.0223 3.9252 3.9606 3.9299 3.8224 3.9393 4.0306 3.9489 3.9367 3.9540 1.0330 0.9989 1.0039 1.0172 1.0057 1.0016 1.0100 1.0009 1.0058 1.0104 1.0167 1.0033 0.9993 1.0273 1.0253 1.0183 1.0011 1.0027 1.0027 1.0127 0.9997 0.9989 1.0000
dispcorr: -0.023074312 hartree
energy: -1132.697963323996
dipole: 30.48425 -29.29168 1.19257 10.51125 -11.40404 -0.89279 -2.96111 3.17807 0.21696
magnitude: 1.50545 au
magnitude: 3.82654 debye
