program: Orca
programVersion: 5.0.2
elementType: O O O N C C C C C C C C C C C C C C C C C C C C C C H H H H H H H H H H H H H H H H H H H H H H H
charge: 0
multiplicity: 1
keywords: wb97x-d3
keywords: def2-TZVPP
keywords: def2/J RIJCOSX
keywords: DEFGRID2
keywords: scfconv7
keywords: smallprint printgap noloewdin
keywords: NOSOSCF
formula: C22H23NO3
InChI: InChI=1/C22H23NO3/c1-21(2)19(22(21,3)4)20(24)26-18(14-23)15-9-8-12-17(13-15)25-16-10-6-5-7-11-16/h5-13,18-19H,1-4H3
49 atoms
O  0.224346 2.184517 -0.612022
O  1.737317 0.541843 -0.670032
O  -2.360137 -2.817185 1.482841
N  -2.846928 2.533524 -1.789009
C  3.526039 2.648237 0.863343
C  3.865689 2.859553 -0.579124
C  2.40237 2.803869 -0.159681
C  3.782795 1.314142 1.526575
C  3.666565 3.780202 1.85835
C  4.357022 4.211372 -1.052042
C  4.486253 1.747561 -1.394735
C  1.486093 1.703449 -0.503164
C  -0.793418 1.227781 -0.834276
C  -1.188671 0.494916 0.4298
C  -1.93638 1.976399 -1.364855
C  -1.566272 -0.83768 0.33547
C  -1.20881 1.153688 1.648782
C  -1.967032 -1.518498 1.47766
C  -1.601812 0.457804 2.7833
C  -1.980304 -0.869527 2.707885
C  -2.339967 -3.53016 0.311754
C  -1.162645 -4.128077 -0.1120
C  -3.511479 -3.669979 -0.414993
C  -1.16469 -4.877524 -1.278678
C  -3.502753 -4.425494 -1.578538
C  -2.331481 -5.026915 -2.014697
H  1.903686 3.766611 -0.13283
H  3.676967 0.457034 0.870469
H  4.795784 1.301733 1.933461
H  3.093914 1.169153 2.360559
H  3.013216 3.608281 2.715537
H  4.69053 3.836995 2.232852
H  3.410117 4.755276 1.449379
H  5.43066 4.310622 -0.881049
H  4.183655 4.319083 -2.123929
H  3.865715 5.04997 -0.562517
H  4.14493 0.751699 -1.134678
H  4.272363 1.895491 -2.454599
H  5.571088 1.774359 -1.274877
H  -0.485804 0.500992 -1.594038
H  -1.539834 -1.336817 -0.62503
H  -0.923882 2.194524 1.721271
H  -1.618104 0.959782 3.741455
H  -2.289374 -1.411717 3.591702
H  -0.257416 -4.009114 0.469228
H  -4.420247 -3.196911 -0.06641
H  -0.248918 -5.34702 -1.612287
H  -4.416316 -4.540812 -2.146437
H  -2.328555 -5.613985 -2.923122
totalener: -1132.67474733 hartree
nucrepener: 2223.40044490 hartree
electener: -3356.07519223 hartree
oneelecener: -5955.42609911 hartree
twoeener: 2599.35090688 hartree
kineticenergy: 1127.71594390 hartree
xcener: -110.664786026109 hartree
chargesum: -0.0000000
charge: -0.275523 -0.380036 -0.294488 -0.003315 0.079262 0.089935 -0.118999 -0.271373 -0.255878 -0.255158 -0.275412 0.319427 0.301863 0.040953 -0.249596 -0.154828 -0.201885 0.250765 -0.088076 -0.196253 0.192128 -0.147073 -0.145448 -0.125448 -0.123758 -0.114995 0.078015 0.104751 0.089837 0.087976 0.089487 0.092232 0.078769 0.092809 0.091264 0.077460 0.104425 0.086889 0.088356 0.119657 0.100801 0.123503 0.124621 0.126416 0.130366 0.128754 0.129173 0.129095 0.128553
qa: -0.2755 -0.3800 -0.2945 -0.0033 0.0793 0.0899 -0.1190 -0.2714 -0.2559 -0.2552 -0.2754 0.3194 0.3019 0.0410 -0.2496 -0.1548 -0.2019 0.2508 -0.0881 -0.1963 0.1921 -0.1471 -0.1454 -0.1254 -0.1238 -0.1150 0.0780 0.1048 0.0898 0.0880 0.0895 0.0922 0.0788 0.0928 0.0913 0.0775 0.1044 0.0869 0.0884 0.1197 0.1008 0.1235 0.1246 0.1264 0.1304 0.1288 0.1292 0.1291 0.1286
va: 2.1098 2.1161 2.1205 3.1257 3.7388 3.7356 3.9249 3.9230 3.9049 3.9045 3.9199 4.1827 3.8488 3.7364 4.0090 3.9893 4.0192 3.8499 3.9532 4.0335 3.8579 3.9912 4.0094 3.9445 3.9452 3.9345 1.0335 1.0168 0.9996 1.0037 1.0060 1.0018 1.0101 1.0010 1.0061 1.0100 1.0178 1.0037 0.9989 1.0248 1.0234 1.0192 0.9997 1.0135 1.0067 1.0083 0.9997 0.9996 0.9998
dispcorr: -0.023796163 hartree
energy: -1132.698543497654
dipole: 31.22205 -29.87845 1.34360 13.07603 -13.44153 -0.36550 2.48331 -1.99315 0.49015
magnitude: 1.47618 au
magnitude: 3.75215 debye
