program: Orca
programVersion: 5.0.2
elementType: O O O N C C C C C C C C C C C C C C C C C C C C C C H H H H H H H H H H H H H H H H H H H H H H H
charge: 0
multiplicity: 1
keywords: wb97x-d3
keywords: def2-TZVPP
keywords: def2/J RIJCOSX
keywords: DEFGRID2
keywords: scfconv7
keywords: smallprint printgap noloewdin
keywords: NOSOSCF
formula: C22H23NO3
InChI: InChI=1/C22H23NO3/c1-21(2)19(22(21,3)4)20(24)26-18(14-23)15-9-8-12-17(13-15)25-16-10-6-5-7-11-16/h5-13,18-19H,1-4H3
49 atoms
O  0.411495 2.654462 0.347891
O  1.320131 1.581455 -1.38829
O  -1.589085 -2.569638 -0.719345
N  -2.611357 3.898265 0.843252
C  4.044985 2.081697 0.090447
C  3.8505 3.326977 -0.716114
C  2.706407 2.809792 0.151431
C  4.167567 0.734706 -0.585518
C  4.870669 2.124919 1.35943
C  4.476492 4.629592 -0.2646
C  3.76375 3.264056 -2.224104
C  1.460614 2.263654 -0.40942
C  -0.864482 2.166625 -0.040527
C  -1.126155 0.791736 0.524515
C  -1.833285 3.143087 0.464032
C  -1.262812 -0.28577 -0.334273
C  -1.208852 0.608826 1.900334
C  -1.493653 -1.555679 0.181049
C  -1.426867 -0.661548 2.402496
C  -1.570004 -1.749798 1.554013
C  -2.336758 -3.674152 -0.415927
C  -3.664867 -3.561097 -0.023706
C  -1.74629 -4.919284 -0.561425
C  -4.397389 -4.709292 0.22994
C  -2.493736 -6.061503 -0.313014
C  -3.816742 -5.962226 0.089201
H  2.540921 3.375573 1.061483
H  3.847776 -0.057124 0.094149
H  3.58533 0.631805 -1.494234
H  5.214766 0.549117 -0.833363
H  4.705376 3.019759 1.955952
H  4.630876 1.268991 1.992041
H  5.936042 2.073818 1.126322
H  3.945409 5.474716 -0.705802
H  4.461006 4.769249 0.814336
H  5.516939 4.688582 -0.590888
H  3.306294 2.361025 -2.613036
H  3.18548 4.108844 -2.602583
H  4.766725 3.341058 -2.648414
H  -0.953849 2.141934 -1.131063
H  -1.180856 -0.153567 -1.405642
H  -1.111123 1.450481 2.573947
H  -1.48891 -0.814335 3.471545
H  -1.739276 -2.736725 1.964003
H  -4.123183 -2.585498 0.077709
H  -0.712078 -4.987753 -0.872167
H  -5.432355 -4.621872 0.532996
H  -2.03332 -7.033694 -0.429003
H  -4.39469 -6.85463 0.287304
totalener: -1132.67560784 hartree
nucrepener: 2186.47471485 hartree
electener: -3319.15032268 hartree
oneelecener: -5881.58182814 hartree
twoeener: 2562.43150546 hartree
kineticenergy: 1127.72664805 hartree
xcener: -110.666558124295 hartree
chargesum: -0.0000000
charge: -0.266701 -0.397195 -0.295058 -0.005657 0.082406 0.081230 -0.120527 -0.273847 -0.256809 -0.254325 -0.275770 0.353625 0.321287 0.008287 -0.253749 -0.144507 -0.175788 0.191041 -0.119403 -0.142167 0.216485 -0.151691 -0.191197 -0.118948 -0.101216 -0.133674 0.075482 0.088558 0.105405 0.088577 0.077544 0.089759 0.093188 0.090978 0.077544 0.092384 0.105157 0.088566 0.088441 0.114518 0.114915 0.122368 0.129839 0.134111 0.135831 0.127480 0.129253 0.126740 0.127231
qa: -0.2667 -0.3972 -0.2951 -0.0057 0.0824 0.0812 -0.1205 -0.2738 -0.2568 -0.2543 -0.2758 0.3536 0.3213 0.0083 -0.2537 -0.1445 -0.1758 0.1910 -0.1194 -0.1422 0.2165 -0.1517 -0.1912 -0.1189 -0.1012 -0.1337 0.0755 0.0886 0.1054 0.0886 0.0775 0.0898 0.0932 0.0910 0.0775 0.0924 0.1052 0.0886 0.0884 0.1145 0.1149 0.1224 0.1298 0.1341 0.1358 0.1275 0.1293 0.1267 0.1272
va: 2.1319 2.0979 2.1084 3.1217 3.7252 3.7297 3.9363 3.9218 3.9082 3.9074 3.9226 4.1578 3.8361 3.6688 4.0194 4.0374 4.0343 3.9163 3.9656 3.9301 3.8263 3.9538 4.0323 3.9441 3.9360 3.9519 1.0337 1.0033 1.0171 0.9986 1.0102 1.0065 1.0007 1.0061 1.0100 1.0010 1.0168 1.0029 0.9994 1.0230 1.0310 1.0167 1.0011 1.0039 1.0021 1.0123 0.9995 0.9990 0.9999
dispcorr: -0.023226688 hartree
energy: -1132.698834523326
dipole: 30.47653 -29.35015 1.12638 7.11918 -8.20914 -1.08996 -0.73554 1.07523 0.33969
magnitude: 1.60378 au
magnitude: 4.07649 debye
