program: Gaussian 09
title: 000007677
version: EM64L-G09RevD.01
frameworkgroup: C1[X(C6H14N2O)]
method: RPBEPBE
basis: SDD
operation: Freq
keyword: #p
keyword: freq=noraman
keyword: PBEPBE/SDD
title: #p freq=noraman PBEPBE/SDD
converged: YES YES NO NO
title: Mulliken charges:
elementType: O N N C C C C C C H H H H H H H H H H H H H H
charge: -0.458081 -0.102409 -0.295327 -0.323678 -0.333412 -0.417370 -0.415602 -0.318847 -0.332694 0.193325 0.192681 0.204263 0.191094 0.187817 0.206235 0.205873 0.188682 0.202318 0.217745 0.266450 0.205109 0.191087 0.344742
chargesum: 0.00000
title: Mulliken charges with hydrogens summed into heavy atoms:
elementType: O N N C C C C C C
charge: -0.113339 -0.102409 -0.028877 0.062327 0.061945 -0.023318 -0.021046 0.101216 0.063502
polarizability: 9.81443955e+01 1.21674917e+00 7.90416000e+01 -1.03952517e-01 6.87524066e-01 6.66445456e+01
1716.lowfreq: -26.6169 -6.3094 -0.0009 -0.0007 -0.0003 19.6017 56.0569 69.0127 109.7864
frequency: 55.7691 68.3931 109.7586 216.4274 256.3090 260.5539 299.3657 320.0150 358.8887 408.9224 461.0419 473.1556 569.7252 688.8360 768.6834 814.7350 847.1223 883.5715 912.7406 973.4807 998.1301 1032.4995 1052.7047 1061.7574 1068.8129 1101.9566 1136.0237 1140.3547 1163.4102 1187.5388 1195.4934 1212.4983 1256.5679 1268.0565 1289.8023 1302.4344 1318.6512 1328.7968 1350.1614 1377.2828 1383.7419 1416.0795 1444.8704 1452.6924 1456.2387 1461.9113 1468.2692 1473.6654 1484.8611 2861.7344 2868.6442 2878.9334 2884.0858 2899.7196 2948.9248 3006.1225 3032.0024 3035.8217 3037.5190 3041.8294 3049.2772 3456.8584 3575.8570
redmass: 2.3758 4.3073 2.8186 2.7414 1.1692 1.6006 5.7170 2.2160 2.6699 2.1746 2.9245 2.4710 1.9345 1.6742 3.5256 1.1851 1.4559 2.7138 2.1934 6.4478 2.4939 2.2187 1.6781 1.7898 1.8958 2.2660 1.7675 2.6446 3.0908 1.1115 1.1136 1.2312 1.5359 1.2689 1.2293 1.2670 1.2496 1.3184 1.3600 1.3955 1.4573 1.4735 1.3510 1.0807 1.0759 1.0935 1.1036 1.0873 1.0841 1.0709 1.0697 1.0699 1.0683 1.0691 1.0569 1.1021 1.0910 1.0907 1.0897 1.0887 1.0939 1.0752 1.0666
irintensity: 9.7091 1.6604 1.2425 14.7328 133.9880 22.3846 2.1867 7.8428 8.6293 0.3622 0.4725 60.0297 34.6079 80.7481 9.6843 0.8478 0.0878 0.3946 0.6559 108.6699 27.9521 7.8885 0.1390 8.5266 15.9411 5.9165 14.1498 36.0866 21.4328 1.3869 2.6567 32.3786 6.4177 2.7725 9.8502 4.0774 41.4698 5.1377 0.0731 1.5348 0.9126 0.2339 2.0392 0.4355 1.0479 14.8465 6.7465 7.7826 6.9862 88.9562 15.2464 13.7278 199.1968 148.3060 67.0117 45.0412 12.9884 60.8475 94.2673 7.0081 74.6831 1.8861 3.2139
temp: 298.150 k
press: 1.00000 atm
elementType: 8 7 7 6 6 6 6 6 6 1 1 1 1 1 1 1 1 1 1 1 1 1 1
symmnumber: 1
zpe: 533594.8 jmol-1
zpe.correction: 0.203236 hartree
zpe.thermalcorrener: 0.212966 hartree
zpe.thermalcorrenthalpy: 0.213910 hartree
zpe.thermalcorrgfe: 0.168069 hartree
zpe.sumelectzpe: -420.962107 hartree
zpe.sumelectthermal: -420.952377 hartree
zpe.sumelectthermalent: -420.951433 hartree
zpe.sumelectthermalfe: -420.997274 hartree
dipole: -0.6618 1.0386 1.7059
dipole: 2.1040
quadrupole: -51.7444 -52.6553 -58.5214
quadrupole: 4.1256 2.8928 0.4747
quadrupole: 2.5626 1.6518 -4.2144 4.1256 2.8928 0.4747
hfenergy: -421.1653425 hartree
pointgroup: C01 [X(C6H14N2O1)]
dipole: -0.2601522 -0.4408752 -0.6505046 debye
dipolederiv: -0.9006041 -0.1041393 -0.1302687 -0.1300146 -0.4220954 0.1927391 -0.1810694 0.1934973 -0.3504353 -0.7309509 0.0307224 0.0091251 -0.005887 -0.5083504 -0.0105385 0.0058268 0.0140475 -0.5395361 -0.3811377 0.0474257 0.1364108 0.0608062 -0.5306804 0.0179658 0.2140795 0.031697 -0.5800453 0.094648 0.1236697 -0.1003823 0.1309021 0.3654711 -0.0716227 -0.1016556 -0.0860805 0.4207192 0.2461054 -0.2225443 -0.062567 -0.2561852 0.3463963 0.0531263 -0.0769537 0.0705445 0.356811 0.262639 -0.2387661 -0.0760748 -0.1612541 0.3491787 0.0615968 -0.0388173 0.0542752 0.3648844 0.1334358 0.1486821 -0.1038726 0.0890132 0.414502 -0.0956471 -0.059118 -0.0776791 0.4055054 0.5018845 0.0553134 0.0808559 0.0794515 0.0918369 -0.0332466 0.0793849 -0.0281666 0.3352932 0.704994 0.0838357 0.0975824 0.1090074 0.3328889 -0.0797123 0.0899225 -0.1057254 0.2847735 0.0152509 -0.0577373 0.0151444 -0.0533931 -0.0038178 -0.0690738 0.0374038 0.0912965 -0.2703601 -0.0306741 0.1440266 0.0153741 0.1220768 -0.0899325 -0.0150982 0.0410726 -0.0344462 0.0545511 0.0152911 -0.1019352 0.0409129 -0.0491097 -0.1279737 0.0677082 0.0477099 0.0893951 0.0336362 -0.0186719 0.0678657 -0.0032472 0.0713773 -0.0045061 -0.0079522 0.0692859 -0.1587999 -0.2465099 -0.0071076 0.0901731 0.0397611 0.0539517 -0.0152947 -0.0240056 0.0328669 -0.1688692 -0.2550967 -0.0013799 -0.0827238 0.032884 -0.065587 -0.1475436 0.0703583 0.0589097 0.1046805 0.0401045 -0.069246 0.1297745 0.0157642 0.1154167 -0.1102954 -0.0081685 0.0551027 -0.0332211 0.0698513 0.036462 -0.0669454 0.0602251 -0.039758 -0.0184445 -0.0322386 -0.0004748 0.1025698 -0.2917566 -0.0445015 -0.0105273 0.0063125 0.0344879 0.0585139 0.0565735 -0.1215367 0.0121342 -0.2247509 0.0456932 -0.0129954 -0.0060571 -0.0565138 -0.1443565 0.0140774 0.0175347 0.0321575 0.068359 -0.0031019 -0.0262625 -0.0797493 -0.0446596 0.0810346 0.0120358 -0.2243231 -0.0112396 0.2735318 -0.0228414 -0.0106327 -0.0395425 -0.0240245 0.0413573 0.0672757 -0.0401554 0.0346592 -0.2034529 -0.0227838 -0.0640562 -0.0297918 -0.0936845 -0.2210219 -0.012466 -0.0261513 0.0271937 0.0447679 0.176597 0.0777767 0.081201 0.1135801 0.2631331 -0.1536866 0.1211554 -0.1539206 0.2091551 unknown
polarizability: 98.1574945|-1.1083094|79.0663066|0.0564673|0.1114707|66.6067401 unknown
InChI: InChI=1S/C6H14N2O/c9-6-5-8-3-1-7-2-4-8/h7,9H,1-6H2
charge 0 multiplicity 1
23 atoms
O  3.844034 0.024265 0.063121
N  0.109079 0.173822 -0.09878
N  -2.717162 -0.270477 0.154975
C  -0.423135 -1.085444 0.485711
C  -0.825573 1.30104 0.158714
C  -1.806911 -1.406887 -0.10759
C  -2.210467 0.987494 -0.437074
C  1.496981 0.465192 0.33531
C  2.522202 -0.325514 -0.488813
H  -0.5208 -1.003722 1.597824
H  0.273823 -1.9138 0.26274
H  -0.416819 2.213635 -0.313649
H  -0.946262 1.496041 1.253972
H  -1.676897 -1.61427 -1.198667
H  -2.213127 -2.315396 0.37428
H  -2.909694 1.809176 -0.195462
H  -2.10376 0.929585 -1.548499
H  1.66133 0.249776 1.418675
H  1.699041 1.541482 0.185659
H  -3.690233 -0.470445 -0.10839
H  2.435269 -0.035969 -1.555849
H  2.338212 -1.417477 -0.402931
H  4.54947 -0.432908 -0.458978
