program: Orca
programVersion: 5.0.2
elementType: O O O N C C C C C C C C C C C C C C C C C C C C C C H H H H H H H H H H H H H H H H H H H H H H H
charge: 0
multiplicity: 1
keywords: wb97x-d3
keywords: def2-TZVPP
keywords: def2/J RIJCOSX
keywords: DEFGRID2
keywords: scfconv7
keywords: smallprint printgap noloewdin
keywords: NOSOSCF
formula: C22H23NO3
InChI: InChI=1/C22H23NO3/c1-21(2)19(22(21,3)4)20(24)26-18(14-23)15-9-8-12-17(13-15)25-16-10-6-5-7-11-16/h5-13,18-19H,1-4H3
49 atoms
O  0.452582 1.553437 0.601861
O  0.792492 2.834231 -1.199081
O  -3.029531 -2.465197 -0.196378
N  -1.717245 1.901603 3.078932
C  3.461702 1.213644 -1.489966
C  3.839321 2.337537 -0.577159
C  2.586833 1.519814 -0.277608
C  2.969559 1.493259 -2.892226
C  4.220512 -0.095606 -1.437166
C  4.977125 2.167777 0.407028
C  3.736594 3.77289 -1.041371
C  1.221985 2.059504 -0.386332
C  -0.923281 1.914165 0.590143
C  -1.726208 0.957816 -0.257772
C  -1.355292 1.900149 1.98908
C  -1.987011 -0.326703 0.205741
C  -2.160195 1.356102 -1.513376
C  -2.690542 -1.212315 -0.597415
C  -2.869806 0.463278 -2.303306
C  -3.132795 -0.818359 -1.855506
C  -2.236583 -3.145354 0.686327
C  -0.874407 -3.304684 0.465315
C  -2.847671 -3.729842 1.784284
C  -0.125636 -4.053553 1.359102
C  -2.088485 -4.486263 2.664654
C  -0.726859 -4.646824 2.460142
H  2.692811 0.820056 0.543964
H  2.344899 0.669892 -3.242839
H  2.387242 2.40234 -2.992787
H  3.824258 1.565146 -3.567712
H  3.610672 -0.899521 -1.852795
H  5.132836 -0.033622 -2.033889
H  4.505176 -0.395207 -0.430607
H  4.869332 2.87719 1.22893
H  5.028093 1.173953 0.846775
H  5.935748 2.366269 -0.076114
H  2.906953 3.972056 -1.710931
H  3.625992 4.437752 -0.18289
H  4.657865 4.055336 -1.554777
H  -1.050851 2.933647 0.213969
H  -1.660042 -0.627331 1.194249
H  -1.938441 2.350738 -1.875402
H  -3.214562 0.766751 -3.28255
H  -3.685573 -1.519227 -2.467072
H  -0.40381 -2.853283 -0.398867
H  -3.909832 -3.594913 1.93974
H  0.935253 -4.1791 1.187701
H  -2.566368 -4.943665 3.520677
H  -0.137513 -5.23242 3.152512
totalener: -1132.67578866 hartree
nucrepener: 2243.80156694 hartree
electener: -3376.47735559 hartree
oneelecener: -5996.16816914 hartree
twoeener: 2619.69081355 hartree
kineticenergy: 1127.72638961 hartree
xcener: -110.667014662399 hartree
chargesum: -0.0000000
charge: -0.264854 -0.402568 -0.296721 -0.004749 0.080551 0.084312 -0.126924 -0.274281 -0.254884 -0.255171 -0.275859 0.362703 0.330852 -0.008081 -0.264368 -0.155294 -0.138060 0.201009 -0.093221 -0.198478 0.226029 -0.158437 -0.193265 -0.110050 -0.092054 -0.137921 0.076201 0.087097 0.104666 0.089723 0.088872 0.092735 0.077547 0.091761 0.077243 0.092432 0.104485 0.088107 0.089521 0.118282 0.132046 0.120820 0.127596 0.128635 0.128776 0.126291 0.125247 0.126111 0.125592
qa: -0.2649 -0.4026 -0.2967 -0.0047 0.0806 0.0843 -0.1269 -0.2743 -0.2549 -0.2552 -0.2759 0.3627 0.3309 -0.0081 -0.2644 -0.1553 -0.1381 0.2010 -0.0932 -0.1985 0.2260 -0.1584 -0.1933 -0.1101 -0.0921 -0.1379 0.0762 0.0871 0.1047 0.0897 0.0889 0.0927 0.0775 0.0918 0.0772 0.0924 0.1045 0.0881 0.0895 0.1183 0.1320 0.1208 0.1276 0.1286 0.1288 0.1263 0.1252 0.1261 0.1256
va: 2.1328 2.0896 2.1103 3.1189 3.7253 3.7246 3.9411 3.9221 3.9053 3.9068 3.9220 4.1512 3.8193 3.7035 4.0321 3.9726 3.9821 3.8823 3.9566 4.0314 3.8301 3.9620 4.0454 3.9449 3.9358 3.9632 1.0338 1.0036 1.0174 0.9992 1.0062 1.0012 1.0102 1.0060 1.0102 1.0012 1.0168 1.0034 0.9991 1.0227 1.0144 1.0210 0.9997 1.0116 1.0047 1.0131 1.0002 0.9991 1.0004
dispcorr: -0.023755323 hartree
energy: -1132.699543982747
dipole: 31.95723 -30.78856 1.16867 5.30708 -5.88820 -0.58112 -10.74840 9.71049 -1.03791
magnitude: 1.66756 au
magnitude: 4.23860 debye
