program: Orca
programVersion: 5.0.2
elementType: O O O N C C C C C C C C C C C C C C C C C C C C C C H H H H H H H H H H H H H H H H H H H H H H H
charge: 0
multiplicity: 1
keywords: wb97x-d3
keywords: def2-TZVPP
keywords: def2/J RIJCOSX
keywords: DEFGRID2
keywords: scfconv7
keywords: smallprint printgap noloewdin
keywords: NOSOSCF
formula: C22H23NO3
InChI: InChI=1/C22H23NO3/c1-21(2)19(22(21,3)4)20(24)26-18(14-23)15-9-8-12-17(13-15)25-16-10-6-5-7-11-16/h5-13,18-19H,1-4H3
49 atoms
O  0.227355 2.369415 -0.326475
O  1.584946 0.650848 -0.767261
O  -1.691223 -2.836791 1.241274
N  -2.712437 3.266673 -1.525354
C  3.683152 2.238992 0.951385
C  3.864101 2.809989 -0.419416
C  2.458716 2.695643 0.164992
C  3.93544 0.771242 1.211886
C  4.027135 3.069699 2.169584
C  4.387238 4.220217 -0.590585
C  4.297574 1.927875 -1.56839
C  1.439581 1.770347 -0.356205
C  -0.878185 1.580205 -0.737453
C  -1.381891 0.70521 0.385109
C  -1.901506 2.534326 -1.172061
C  -1.314545 -0.672524 0.258724
C  -1.872566 1.282869 1.55085
C  -1.76472 -1.479477 1.297647
C  -2.297832 0.468916 2.58591
C  -2.254391 -0.911862 2.463433
C  -2.017035 -3.48716 0.084688
C  -1.24584 -4.585851 -0.264305
C  -3.106519 -3.113006 -0.69262
C  -1.571103 -5.316888 -1.39644
C  -3.413268 -3.847329 -1.827774
C  -2.650733 -4.949638 -2.185697
H  2.03372 3.63614 0.497675
H  3.354151 0.436393 2.072536
H  3.687672 0.116552 0.383831
H  4.990129 0.624124 1.452924
H  3.521946 2.670674 3.050214
H  5.100728 3.037993 2.364343
H  3.738355 4.114901 2.081308
H  5.478201 4.231549 -0.549532
H  4.090316 4.61589 -1.563121
H  4.022152 4.915046 0.162873
H  5.387495 1.868876 -1.58959
H  3.909607 0.915777 -1.530703
H  3.977138 2.36245 -2.516857
H  -0.613739 0.959655 -1.599535
H  -0.90149 -1.116773 -0.638337
H  -1.927936 2.359615 1.648234
H  -2.682713 0.910526 3.495192
H  -2.595847 -1.552518 3.265731
H  -0.401956 -4.862997 0.353487
H  -3.715703 -2.262404 -0.414448
H  -0.969321 -6.174869 -1.66533
H  -4.262298 -3.556017 -2.43188
H  -2.898362 -5.519016 -3.071101
totalener: -1132.67570483 hartree
nucrepener: 2219.79539003 hartree
electener: -3352.47109486 hartree
oneelecener: -5948.19793496 hartree
twoeener: 2595.72684010 hartree
kineticenergy: 1127.72970965 hartree
xcener: -110.667332834302 hartree
chargesum: 0.0000000
charge: -0.265965 -0.396062 -0.299356 -0.004281 0.083513 0.084268 -0.127819 -0.272540 -0.256362 -0.254514 -0.276306 0.354613 0.323634 0.005320 -0.257143 -0.103466 -0.182320 0.191275 -0.097846 -0.186923 0.232491 -0.206010 -0.154550 -0.090412 -0.118452 -0.144125 0.075698 0.089084 0.103898 0.088841 0.089707 0.093311 0.078008 0.092687 0.091587 0.077442 0.089460 0.104845 0.087807 0.113957 0.121909 0.122755 0.128588 0.129774 0.125877 0.133610 0.125696 0.128857 0.125938
qa: -0.2660 -0.3961 -0.2994 -0.0043 0.0835 0.0843 -0.1278 -0.2725 -0.2564 -0.2545 -0.2763 0.3546 0.3236 0.0053 -0.2571 -0.1035 -0.1823 0.1913 -0.0978 -0.1869 0.2325 -0.2060 -0.1545 -0.0904 -0.1185 -0.1441 0.0757 0.0891 0.1039 0.0888 0.0897 0.0933 0.0780 0.0927 0.0916 0.0774 0.0895 0.1048 0.0878 0.1140 0.1219 0.1228 0.1286 0.1298 0.1259 0.1336 0.1257 0.1289 0.1259
va: 2.1327 2.0993 2.1083 3.1218 3.7246 3.7273 3.9443 3.9223 3.9069 3.9068 3.9218 4.1549 3.8448 3.6404 4.0189 3.9146 4.0345 3.8851 3.9430 4.0383 3.8166 4.0375 3.9324 3.9362 3.9531 3.9616 1.0336 1.0034 1.0172 0.9987 1.0065 1.0008 1.0101 1.0010 1.0061 1.0100 0.9994 1.0168 1.0033 1.0231 1.0212 1.0162 0.9996 1.0107 1.0137 1.0039 0.9987 0.9996 1.0002
dispcorr: -0.023519455 hartree
energy: -1132.699224285550
dipole: 30.21159 -29.08299 1.12860 9.85817 -10.26863 -0.41046 2.60099 -1.99944 0.60154
magnitude: 1.34316 au
magnitude: 3.41403 debye
