program: Orca
programVersion: 5.0.2
elementType: O O O N C C C C C C C C C C C C C C C C C C C C C C H H H H H H H H H H H H H H H H H H H H H H H
charge: 0
multiplicity: 1
keywords: wb97x-d3
keywords: def2-TZVPP
keywords: def2/J RIJCOSX
keywords: DEFGRID2
keywords: scfconv7
keywords: smallprint printgap noloewdin
keywords: NOSOSCF
formula: C22H23NO3
InChI: InChI=1/C22H23NO3/c1-21(2)19(22(21,3)4)20(24)26-18(14-23)15-9-8-12-17(13-15)25-16-10-6-5-7-11-16/h5-13,18-19H,1-4H3
49 atoms
O  0.329459 2.195739 -0.621485
O  1.727602 0.460231 -0.488993
O  -1.973423 -2.773049 1.370448
N  -2.41382 2.761035 -2.368609
C  3.555957 2.439162 1.137731
C  3.954853 2.674631 -0.285245
C  2.475045 2.67774 0.088084
C  3.73251 1.077971 1.772176
C  3.723094 3.538229 2.165449
C  4.525517 4.01279 -0.704587
C  4.542936 1.555426 -1.115031
C  1.531915 1.637466 -0.353411
C  -0.692653 1.307084 -1.043305
C  -1.356731 0.609669 0.12012
C  -1.652167 2.134267 -1.780064
C  -1.351062 -0.774319 0.178859
C  -1.955174 1.355634 1.128847
C  -1.973537 -1.418683 1.242255
C  -2.551682 0.703107 2.193739
C  -2.572374 -0.682226 2.252751
C  -2.140947 -3.562479 0.267671
C  -3.082956 -3.271727 -0.711939
C  -1.367831 -4.710899 0.183687
C  -3.238533 -4.13826 -1.782381
C  -1.541907 -5.57386 -0.887511
C  -2.47148 -5.290511 -1.877007
H  2.021958 3.662449 0.122671
H  4.736318 1.003714 2.194903
H  3.023203 0.950839 2.591705
H  3.592163 0.242902 1.094789
H  4.741882 3.544067 2.557653
H  3.513016 4.533198 1.778487
H  3.048234 3.370952 3.006364
H  4.05917 4.861263 -0.208175
H  5.596443 4.054978 -0.496743
H  4.393543 4.156584 -1.778102
H  5.624491 1.52763 -0.969049
H  4.150407 0.570406 -0.887736
H  4.362999 1.738953 -2.175656
H  -0.294882 0.561226 -1.73913
H  -0.855364 -1.349051 -0.593516
H  -1.962038 2.437011 1.080935
H  -3.020838 1.276007 2.982164
H  -3.047459 -1.196723 3.077504
H  -3.694016 -2.381073 -0.640538
H  -0.641094 -4.923202 0.956684
H  -3.972883 -3.910353 -2.543561
H  -0.940221 -6.470917 -0.949711
H  -2.601178 -5.964096 -2.713027
totalener: -1132.67549506 hartree
nucrepener: 2216.48139262 hartree
electener: -3349.15688768 hartree
oneelecener: -5941.58067170 hartree
twoeener: 2592.42378402 hartree
kineticenergy: 1127.72239162 hartree
xcener: -110.665971487224 hartree
chargesum: -0.0000000
charge: -0.268175 -0.393151 -0.298833 -0.004276 0.081746 0.082129 -0.123051 -0.274021 -0.254994 -0.255047 -0.275297 0.348755 0.320666 0.016092 -0.254922 -0.110847 -0.187200 0.196631 -0.096492 -0.188085 0.234277 -0.159593 -0.206000 -0.115570 -0.089716 -0.145293 0.076165 0.089049 0.089152 0.105451 0.092052 0.077597 0.090656 0.077840 0.092933 0.091232 0.088932 0.105217 0.087340 0.113797 0.119398 0.123674 0.128835 0.128876 0.134965 0.125760 0.129151 0.126096 0.126099
qa: -0.2682 -0.3932 -0.2988 -0.0043 0.0817 0.0821 -0.1231 -0.2740 -0.2550 -0.2550 -0.2753 0.3488 0.3207 0.0161 -0.2549 -0.1108 -0.1872 0.1966 -0.0965 -0.1881 0.2343 -0.1596 -0.2060 -0.1156 -0.0897 -0.1453 0.0762 0.0890 0.0892 0.1055 0.0921 0.0776 0.0907 0.0778 0.0929 0.0912 0.0889 0.1052 0.0873 0.1138 0.1194 0.1237 0.1288 0.1289 0.1350 0.1258 0.1292 0.1261 0.1261
va: 2.1313 2.1040 2.1101 3.1225 3.7282 3.7305 3.9420 3.9216 3.9068 3.9057 3.9221 4.1582 3.8493 3.6403 4.0179 3.9250 4.0313 3.8822 3.9432 4.0364 3.8151 3.9381 4.0411 3.9502 3.9343 3.9627 1.0333 0.9990 1.0031 1.0168 1.0016 1.0104 1.0059 1.0101 1.0008 1.0061 0.9992 1.0170 1.0035 1.0234 1.0195 1.0167 0.9994 1.0111 1.0035 1.0138 0.9996 0.9986 1.0003
dispcorr: -0.023485816 hartree
energy: -1132.698980873767
dipole: 29.80848 -28.75123 1.05725 11.25553 -11.50990 -0.25437 5.19293 -4.42210 0.77083
magnitude: 1.33291 au
magnitude: 3.38800 debye
