program: Orca
programVersion: 5.0.2
elementType: O O O N C C C C C C C C C C C C C C C C C C C C C C H H H H H H H H H H H H H H H H H H H H H H H
charge: 0
multiplicity: 1
keywords: wb97x-d3
keywords: def2-TZVPP
keywords: def2/J RIJCOSX
keywords: DEFGRID2
keywords: scfconv7
keywords: smallprint printgap noloewdin
keywords: NOSOSCF
formula: C22H23NO3
InChI: InChI=1/C22H23NO3/c1-21(2)19(22(21,3)4)20(24)26-18(14-23)15-9-8-12-17(13-15)25-16-10-6-5-7-11-16/h5-13,18-19H,1-4H3
49 atoms
O  0.057437 2.390262 -0.076224
O  1.049449 0.676212 -1.11241
O  -2.811978 -2.442922 -0.004122
N  -2.377004 4.384393 -1.119061
C  3.126443 0.873012 1.229131
C  3.689304 1.775943 0.177398
C  2.225145 1.920612 0.577911
C  2.924131 -0.599353 0.949588
C  3.459923 1.10364 2.687618
C  4.589327 2.928477 0.573413
C  4.076879 1.230831 -1.178718
C  1.100478 1.56235 -0.30172
C  -1.146902 2.105332 -0.779917
C  -1.994871 1.124153 -0.007397
C  -1.825495 3.390124 -0.957876
C  -2.005784 -0.207466 -0.39618
C  -2.709587 1.536406 1.111478
C  -2.729482 -1.131961 0.347688
C  -3.439087 0.608495 1.83438
C  -3.447121 -0.726899 1.463288
C  -1.7092 -3.114153 -0.449832
C  -1.921811 -4.101516 -1.40152
C  -0.433988 -2.881155 0.0511
C  -0.853012 -4.860599 -1.850463
C  0.626926 -3.64192 -0.415373
C  0.426334 -4.632903 -1.364604
H  2.009942 2.780052 1.203029
H  3.840636 -1.143127 1.187309
H  2.135179 -0.996188 1.592363
H  2.653086 -0.830516 -0.074918
H  4.425184 0.656924 2.934258
H  3.502614 2.154987 2.964171
H  2.708473 0.634359 3.32451
H  5.615801 2.583742 0.712638
H  4.600089 3.683036 -0.214496
H  4.28134 3.426923 1.490162
H  3.455274 0.416535 -1.534309
H  4.032605 2.022113 -1.928912
H  5.108266 0.874308 -1.143007
H  -0.925818 1.705466 -1.773956
H  -1.443761 -0.524187 -1.265622
H  -2.70944 2.57677 1.410875
H  -4.003888 0.924581 2.701013
H  -4.012096 -1.457127 2.027351
H  -2.922064 -4.27184 -1.777902
H  -0.262251 -2.116141 0.797063
H  -1.023883 -5.630572 -2.591142
H  1.619334 -3.456518 -0.02537
H  1.25915 -5.222788 -1.722242
totalener: -1132.67535364 hartree
nucrepener: 2284.07419417 hartree
electener: -3416.74954780 hartree
oneelecener: -6076.54845375 hartree
twoeener: 2659.79890595 hartree
kineticenergy: 1127.71984910 hartree
xcener: -110.666486619051 hartree
chargesum: -0.0000000
charge: -0.261943 -0.401274 -0.298619 -0.004838 0.107840 0.084963 -0.128784 -0.318786 -0.253691 -0.257601 -0.273233 0.361070 0.323157 0.003133 -0.256977 -0.152141 -0.173267 0.224426 -0.097112 -0.195542 0.256250 -0.223231 -0.157821 -0.082850 -0.102633 -0.156565 0.077601 0.097165 0.086792 0.107142 0.093168 0.079038 0.090709 0.092835 0.091862 0.078559 0.105164 0.088600 0.088249 0.117550 0.134854 0.121484 0.129835 0.128558 0.125523 0.123961 0.124867 0.128021 0.124528
qa: -0.2619 -0.4013 -0.2986 -0.0048 0.1078 0.0850 -0.1288 -0.3188 -0.2537 -0.2576 -0.2732 0.3611 0.3232 0.0031 -0.2570 -0.1521 -0.1733 0.2244 -0.0971 -0.1955 0.2563 -0.2232 -0.1578 -0.0828 -0.1026 -0.1566 0.0776 0.0972 0.0868 0.1071 0.0932 0.0790 0.0907 0.0928 0.0919 0.0786 0.1052 0.0886 0.0882 0.1175 0.1349 0.1215 0.1298 0.1286 0.1255 0.1240 0.1249 0.1280 0.1245
va: 2.1310 2.0828 2.1170 3.1188 3.7088 3.7240 3.9480 3.9341 3.9047 3.9070 3.9210 4.1437 3.8247 3.6822 4.0205 3.9225 4.0456 3.8664 3.9430 4.0500 3.8345 4.0400 3.9447 3.9349 3.9432 3.9955 1.0334 1.0010 0.9980 1.0050 1.0010 1.0107 1.0057 1.0009 1.0062 1.0098 1.0164 1.0036 0.9990 1.0238 1.0196 1.0163 0.9997 1.0115 1.0143 1.0025 0.9984 0.9972 1.0015
dispcorr: -0.025559157 hartree
energy: -1132.700912791814
dipole: 31.93037 -30.64551 1.28486 -1.17807 0.21399 -0.96408 7.97825 -7.17399 0.80426
magnitude: 1.79643 au
magnitude: 4.56616 debye
