program: Orca
programVersion: 5.0.2
elementType: O O O N C C C C C C C C C C C C C C C C C C C C C C H H H H H H H H H H H H H H H H H H H H H H H
charge: 0
multiplicity: 1
keywords: wb97x-d3
keywords: def2-TZVPP
keywords: def2/J RIJCOSX
keywords: DEFGRID2
keywords: scfconv7
keywords: smallprint printgap noloewdin
keywords: NOSOSCF
formula: C22H23NO3
InChI: InChI=1/C22H23NO3/c1-21(2)19(22(21,3)4)20(24)26-18(14-23)15-9-8-12-17(13-15)25-16-10-6-5-7-11-16/h5-13,18-19H,1-4H3
49 atoms
O  0.983756 1.246482 0.502266
O  0.770084 3.102148 -0.727069
O  -2.397839 -2.872725 -0.696605
N  -0.537653 0.459178 3.333242
C  3.57728 2.330257 -1.893066
C  3.913233 3.106527 -0.65836
C  2.891217 1.974456 -0.578666
C  2.807602 2.976937 -3.022079
C  4.54407 1.2941 -2.426462
C  5.220064 2.861264 0.064834
C  3.481595 4.548589 -0.513869
C  1.461849 2.20815 -0.316748
C  -0.385821 1.337834 0.876967
C  -1.27213 0.552094 -0.059349
C  -0.458612 0.839511 2.252557
C  -1.420107 -0.819728 0.097217
C  -1.907415 1.211745 -1.104372
C  -2.228345 -1.526874 -0.782918
C  -2.696377 0.491044 -1.987051
C  -2.866632 -0.873615 -1.828819
C  -2.51257 -3.478753 0.523638
C  -1.91908 -4.723977 0.667395
C  -3.236658 -2.916696 1.567565
C  -2.054697 -5.411358 1.863317
C  -3.353464 -3.610506 2.761702
C  -2.7649 -4.856675 2.917275
H  3.259405 1.070192 -0.107022
H  2.079197 3.715201 -2.705905
H  3.506867 3.465529 -3.70344
H  2.271036 2.218338 -3.594299
H  5.31013 1.767079 -3.044265
H  5.050744 0.727244 -1.648057
H  4.013764 0.575832 -3.053931
H  6.023895 3.444112 -0.389741
H  5.136855 3.173861 1.107116
H  5.529094 1.817986 0.065814
H  2.530991 4.785273 -0.978993
H  3.400018 4.812369 0.54203
H  4.240484 5.199081 -0.952994
H  -0.707619 2.383448 0.887128
H  -0.923231 -1.336109 0.910189
H  -1.780843 2.278238 -1.230404
H  -3.194536 0.999747 -2.801305
H  -3.492649 -1.438966 -2.506476
H  -1.36176 -5.147618 -0.157612
H  -3.70768 -1.948792 1.455678
H  -1.591883 -6.383204 1.972349
H  -3.912094 -3.168945 3.576071
H  -2.86043 -5.391363 3.852329
totalener: -1132.67594685 hartree
nucrepener: 2206.87566476 hartree
electener: -3339.55161161 hartree
oneelecener: -5922.49655031 hartree
twoeener: 2582.94493870 hartree
kineticenergy: 1127.72364574 hartree
xcener: -110.667277701987 hartree
chargesum: -0.0000000
charge: -0.265003 -0.407877 -0.299115 -0.005579 0.085960 0.077657 -0.127475 -0.273492 -0.255907 -0.254503 -0.277291 0.369497 0.331118 0.008370 -0.260618 -0.183130 -0.138174 0.204940 -0.101165 -0.191819 0.245397 -0.214870 -0.158345 -0.088136 -0.103912 -0.145719 0.076625 0.102627 0.088912 0.088293 0.092546 0.077982 0.091416 0.092148 0.092005 0.077991 0.105005 0.088650 0.089895 0.120068 0.130687 0.127174 0.128135 0.128456 0.124385 0.129640 0.124609 0.127096 0.124848
qa: -0.2650 -0.4079 -0.2991 -0.0056 0.0860 0.0777 -0.1275 -0.2735 -0.2559 -0.2545 -0.2773 0.3695 0.3311 0.0084 -0.2606 -0.1831 -0.1382 0.2049 -0.1012 -0.1918 0.2454 -0.2149 -0.1583 -0.0881 -0.1039 -0.1457 0.0766 0.1026 0.0889 0.0883 0.0925 0.0780 0.0914 0.0921 0.0920 0.0780 0.1050 0.0887 0.0899 0.1201 0.1307 0.1272 0.1281 0.1285 0.1244 0.1296 0.1246 0.1271 0.1248
va: 2.1273 2.0835 2.1116 3.1157 3.7219 3.7294 3.9411 3.9213 3.9061 3.9067 3.9218 4.1427 3.8144 3.6816 4.0248 3.9974 3.9673 3.8738 3.9572 4.0393 3.8039 4.0412 3.9407 3.9345 3.9577 3.9673 1.0337 1.0171 0.9991 1.0033 1.0010 1.0105 1.0057 1.0010 1.0058 1.0105 1.0169 1.0031 0.9994 1.0236 1.0146 1.0219 1.0000 1.0112 1.0141 1.0046 0.9989 1.0001 1.0005
dispcorr: -0.023526559 hartree
energy: -1132.699473407411
dipole: 27.20847 -26.61406 0.59441 15.44271 -15.29432 0.14839 -11.75092 10.67795 -1.07296
magnitude: 1.23555 au
magnitude: 3.14053 debye
