program: Orca
programVersion: 5.0.2
elementType: O O O N C C C C C C C C C C C C C C C C C C C C C C H H H H H H H H H H H H H H H H H H H H H H H
charge: 0
multiplicity: 1
keywords: wb97x-d3
keywords: def2-TZVPP
keywords: def2/J RIJCOSX
keywords: DEFGRID2
keywords: scfconv7
keywords: smallprint printgap noloewdin
keywords: NOSOSCF
formula: C22H23NO3
InChI: InChI=1/C22H23NO3/c1-21(2)19(22(21,3)4)20(24)26-18(14-23)15-9-8-12-17(13-15)25-16-10-6-5-7-11-16/h5-13,18-19H,1-4H3
49 atoms
O  0.204922 1.52022 -1.429097
O  0.309697 2.178357 0.698121
O  -2.553018 -2.451598 0.255541
N  -1.431029 4.504112 -1.149964
C  3.364285 1.54261 0.537208
C  2.777838 0.179443 0.737948
C  2.201203 1.098373 -0.337655
C  3.186311 2.623707 1.580354
C  4.691986 1.697561 -0.175279
C  3.501842 -1.048885 0.231496
C  1.968388 -0.142142 1.973707
C  0.845504 1.662247 -0.240638
C  -1.147183 1.924739 -1.471395
C  -2.058612 1.085747 -0.597097
C  -1.285697 3.368632 -1.242672
C  -1.831251 -0.287327 -0.554583
C  -3.135598 1.638581 0.072985
C  -2.692879 -1.101304 0.165371
C  -3.995296 0.808584 0.780653
C  -3.784775 -0.554749 0.832072
C  -1.384554 -3.03643 -0.153054
C  -1.23927 -3.451731 -1.468126
C  -0.373932 -3.245753 0.772957
C  -0.065935 -4.082174 -1.855892
C  0.791772 -3.884288 0.376874
C  0.95177 -4.298024 -0.937928
H  2.468969 0.822035 -1.351725
H  3.203049 3.607731 1.109804
H  2.265211 2.557276 2.147616
H  4.019716 2.583911 2.284303
H  4.81528 1.02416 -1.021169
H  4.793656 2.714362 -0.557716
H  5.520624 1.520718 0.513073
H  4.043552 -0.883396 -0.697464
H  4.220723 -1.401469 0.974138
H  2.788335 -1.854408 0.049872
H  1.389496 0.688773 2.36305
H  1.267075 -0.949807 1.756155
H  2.634105 -0.487191 2.767253
H  -1.432678 1.760923 -2.515253
H  -0.985594 -0.714561 -1.078236
H  -3.307597 2.706245 0.060591
H  -4.836744 1.237381 1.307982
H  -4.450232 -1.202266 1.387354
H  -2.041102 -3.286657 -2.176243
H  -0.510239 -2.923436 1.797295
H  0.051191 -4.407298 -2.881068
H  1.57715 -4.05842 1.100842
H  1.862391 -4.795363 -1.243468
totalener: -1132.67113594 hartree
nucrepener: 2338.98767961 hartree
electener: -3471.65881555 hartree
oneelecener: -6186.59795903 hartree
twoeener: 2714.93914348 hartree
kineticenergy: 1127.73006351 hartree
xcener: -110.671677772653 hartree
chargesum: -0.0000000
charge: -0.291200 -0.363551 -0.301046 -0.001937 0.080382 0.092861 -0.088394 -0.271445 -0.261316 -0.249019 -0.264446 0.317920 0.429069 -0.027043 -0.279975 -0.261567 -0.177435 0.273142 -0.066204 -0.211953 0.245385 -0.177467 -0.174012 -0.109362 -0.164405 -0.108008 0.071348 0.092511 0.103896 0.085655 0.076221 0.093284 0.093061 0.078208 0.091942 0.073899 0.110376 0.061597 0.092844 0.118820 0.124320 0.119956 0.126718 0.124497 0.128941 0.138726 0.130076 0.141886 0.132242
qa: -0.2912 -0.3636 -0.3010 -0.0019 0.0804 0.0929 -0.0884 -0.2714 -0.2613 -0.2490 -0.2644 0.3179 0.4291 -0.0270 -0.2800 -0.2616 -0.1774 0.2731 -0.0662 -0.2120 0.2454 -0.1775 -0.1740 -0.1094 -0.1644 -0.1080 0.0713 0.0925 0.1039 0.0857 0.0762 0.0933 0.0931 0.0782 0.0919 0.0739 0.1104 0.0616 0.0928 0.1188 0.1243 0.1200 0.1267 0.1245 0.1289 0.1387 0.1301 0.1419 0.1322
va: 2.1019 2.1250 2.1176 3.1157 3.7741 3.7189 3.9208 3.9216 3.9018 3.8996 3.9140 4.1505 3.9373 3.8370 4.0654 3.9661 4.0182 3.8331 3.9574 4.0470 3.8014 3.9976 3.9774 3.9352 3.8919 3.8996 1.0358 1.0033 1.0194 0.9986 1.0102 1.0057 1.0011 1.0146 1.0018 1.0219 1.0210 1.0193 1.0002 0.9840 1.0291 1.0263 1.0000 1.0145 1.0082 1.0026 0.9985 0.9943 0.9983
dispcorr: -0.027329817 hartree
energy: -1132.698465758840
dipole: 27.97506 -27.01671 0.95835 -4.54659 2.65950 -1.88709 7.51719 -7.86708 -0.34989
magnitude: 2.14522 au
magnitude: 5.45272 debye
