program: Orca
programVersion: 5.0.2
elementType: O O O N C C C C C C C C C C C C C C C C C C C C C C H H H H H H H H H H H H H H H H H H H H H H H
charge: 0
multiplicity: 1
keywords: wb97x-d3
keywords: def2-TZVPP
keywords: def2/J RIJCOSX
keywords: DEFGRID2
keywords: scfconv7
keywords: smallprint printgap noloewdin
keywords: NOSOSCF
formula: C22H23NO3
InChI: InChI=1/C22H23NO3/c1-21(2)19(22(21,3)4)20(24)26-18(14-23)15-9-8-12-17(13-15)25-16-10-6-5-7-11-16/h5-13,18-19H,1-4H3
49 atoms
O  0.328374 2.571327 0.725255
O  0.669022 2.711893 -1.478053
O  -0.669205 -2.290698 0.434797
N  -2.2571 3.068237 2.73953
C  3.291636 1.136305 -0.559463
C  3.726887 2.539368 -0.859093
C  2.514336 2.31908 0.024301
C  2.6685 0.279034 -1.638405
C  4.052582 0.287699 0.435607
C  4.943175 3.111622 -0.160647
C  3.598361 3.10949 -2.255097
C  1.120246 2.565772 -0.376337
C  -1.062923 2.539003 0.476044
C  -1.516533 1.189695 -0.038293
C  -1.71067 2.840399 1.755208
C  -0.92941 0.032917 0.452816
C  -2.527721 1.115277 -0.982545
C  -1.341853 -1.201639 -0.025683
C  -2.947693 -0.125263 -1.436502
C  -2.358501 -1.28876 -0.970659
C  -1.323554 -3.481352 0.586961
C  -0.719078 -4.618342 0.073959
C  -2.524302 -3.567815 1.280141
C  -1.31925 -5.854136 0.263535
C  -3.117863 -4.807838 1.454001
C  -2.520579 -5.954103 0.948485
H  2.678682 2.476958 1.084941
H  2.034006 -0.488495 -1.190827
H  2.057504 0.824497 -2.350644
H  3.45492 -0.231781 -2.197399
H  3.403473 -0.49284 0.836041
H  4.898139 -0.205491 -0.048164
H  4.438805 0.850648 1.282526
H  5.858713 2.797681 -0.665579
H  4.910575 4.201975 -0.186365
H  5.025853 2.819185 0.884328
H  4.507563 2.888959 -2.817889
H  2.754182 2.734011 -2.821932
H  3.498472 4.194999 -2.209849
H  -1.353453 3.316428 -0.239047
H  -0.145003 0.073409 1.198189
H  -2.97799 2.018802 -1.372863
H  -3.731644 -0.188643 -2.179082
H  -2.680156 -2.250518 -1.348016
H  0.216965 -4.530333 -0.461697
H  -2.987414 -2.677437 1.686395
H  -0.844764 -6.742042 -0.132902
H  -4.051342 -4.876916 1.996605
H  -2.98711 -6.919127 1.092032
totalener: -1132.67366700 hartree
nucrepener: 2246.56501831 hartree
electener: -3379.23868531 hartree
oneelecener: -6001.65932381 hartree
twoeener: 2622.42063850 hartree
kineticenergy: 1127.72400820 hartree
xcener: -110.666265764023 hartree
chargesum: 0.0000000
charge: -0.274297 -0.366342 -0.304395 -0.002745 0.077215 0.102120 -0.113404 -0.276799 -0.252807 -0.261085 -0.268558 0.289754 0.319275 0.089219 -0.256854 -0.249422 -0.153863 0.214933 -0.106288 -0.148299 0.209740 -0.193116 -0.142331 -0.103025 -0.124455 -0.130756 0.078014 0.085740 0.104143 0.095429 0.091704 0.091781 0.078503 0.093251 0.091127 0.078022 0.085108 0.103222 0.087903 0.122847 0.126645 0.105095 0.128398 0.135543 0.124885 0.136823 0.125935 0.129109 0.127360
qa: -0.2743 -0.3663 -0.3044 -0.0027 0.0772 0.1021 -0.1134 -0.2768 -0.2528 -0.2611 -0.2686 0.2898 0.3193 0.0892 -0.2569 -0.2494 -0.1539 0.2149 -0.1063 -0.1483 0.2097 -0.1931 -0.1423 -0.1030 -0.1245 -0.1308 0.0780 0.0857 0.1041 0.0954 0.0917 0.0918 0.0785 0.0933 0.0911 0.0780 0.0851 0.1032 0.0879 0.1228 0.1266 0.1051 0.1284 0.1355 0.1249 0.1368 0.1259 0.1291 0.1274
va: 2.1016 2.1263 2.0775 3.1242 3.7642 3.7342 3.9046 3.9212 3.8986 3.9072 3.9119 4.2260 3.8239 3.6378 4.0214 4.0408 4.0482 3.8289 3.9677 3.9553 3.8384 4.0321 3.9438 3.9440 3.9499 3.9486 1.0332 1.0065 1.0159 1.0005 1.0070 1.0016 1.0100 1.0011 1.0059 1.0094 0.9991 1.0178 1.0040 1.0194 1.0299 1.0131 1.0010 1.0028 1.0126 1.0029 0.9993 0.9998 0.9998
dispcorr: -0.024858900 hartree
energy: -1132.698525901829
dipole: 26.13099 -25.40176 0.72922 -0.09424 -0.96911 -1.06335 -9.79528 8.80591 -0.98938
magnitude: 1.62522 au
magnitude: 4.13099 debye
