program: Orca
programVersion: 5.0.2
elementType: O O O N C C C C C C C C C C C C C C C C C C C C C C H H H H H H H H H H H H H H H H H H H H H H H
charge: 0
multiplicity: 1
keywords: wb97x-d3
keywords: def2-TZVPP
keywords: def2/J RIJCOSX
keywords: DEFGRID2
keywords: scfconv7
keywords: smallprint printgap noloewdin
keywords: NOSOSCF
formula: C22H23NO3
InChI: InChI=1/C22H23NO3/c1-21(2)19(22(21,3)4)20(24)26-18(14-23)15-9-8-12-17(13-15)25-16-10-6-5-7-11-16/h5-13,18-19H,1-4H3
49 atoms
O  0.881811 1.466047 -1.135856
O  2.271073 0.851657 0.507005
O  -2.989894 -2.347952 1.516479
N  -0.400373 -0.417479 -3.556418
C  2.998868 3.887324 0.708731
C  3.866588 3.423543 -0.418631
C  2.379444 3.072005 -0.419942
C  3.159118 3.304934 2.095424
C  2.562633 5.33561 0.781875
C  4.311066 4.398605 -1.487837
C  4.908841 2.350657 -0.198716
C  1.887587 1.694972 -0.254564
C  0.277429 0.190887 -1.106244
C  -0.955258 0.147276 -0.227997
C  -0.094013 -0.126249 -2.488561
C  -1.370158 -1.086075 0.252967
C  -1.687133 1.293203 0.043584
C  -2.539245 -1.176532 0.996707
C  -2.836899 1.192715 0.812893
C  -3.273706 -0.033181 1.283406
C  -2.802712 -3.520028 0.837491
C  -3.041393 -3.627173 -0.527234
C  -2.417888 -4.628517 1.57623
C  -2.878464 -4.854947 -1.149111
C  -2.270751 -5.853279 0.942799
C  -2.493482 -5.971454 -0.420595
H  1.78696 3.644926 -1.124678
H  2.216806 3.368225 2.641866
H  3.472054 2.267258 2.116432
H  3.897073 3.889937 2.647838
H  1.671527 5.426703 1.404771
H  3.343838 5.948788 1.235035
H  2.322921 5.769578 -0.186842
H  5.19113 4.953751 -1.157111
H  4.584157 3.861443 -2.397372
H  3.546692 5.122988 -1.760563
H  4.635166 1.600386 0.535283
H  5.113855 1.829145 -1.135012
H  5.842589 2.812524 0.12724
H  0.990455 -0.568279 -0.767146
H  -0.784997 -1.974342 0.045662
H  -1.37266 2.254559 -0.33753
H  -3.411442 2.081826 1.035295
H  -4.177329 -0.114092 1.87263
H  -3.351761 -2.763998 -1.102137
H  -2.24144 -4.526693 2.638916
H  -3.061264 -4.936968 -2.212259
H  -1.972541 -6.71776 1.520997
H  -2.371139 -6.92671 -0.912513
totalener: -1132.67470867 hartree
nucrepener: 2191.76033196 hartree
electener: -3324.43504064 hartree
oneelecener: -5892.06108816 hartree
twoeener: 2567.62604752 hartree
kineticenergy: 1127.72278723 hartree
xcener: -110.667412559868 hartree
chargesum: -0.0000000
charge: -0.285980 -0.383149 -0.297710 -0.004856 0.091252 0.076947 -0.126490 -0.270565 -0.258300 -0.253363 -0.278224 0.334093 0.306053 0.089984 -0.243727 -0.200935 -0.183792 0.221765 -0.097159 -0.191531 0.246592 -0.172917 -0.212024 -0.108642 -0.088791 -0.145446 0.075733 0.088447 0.105845 0.087480 0.090195 0.093291 0.078298 0.093677 0.091942 0.077203 0.104181 0.089700 0.091039 0.123705 0.118685 0.125221 0.126269 0.128637 0.137580 0.125600 0.131428 0.126399 0.126359
qa: -0.2860 -0.3831 -0.2977 -0.0049 0.0913 0.0769 -0.1265 -0.2706 -0.2583 -0.2534 -0.2782 0.3341 0.3061 0.0900 -0.2437 -0.2009 -0.1838 0.2218 -0.0972 -0.1915 0.2466 -0.1729 -0.2120 -0.1086 -0.0888 -0.1454 0.0757 0.0884 0.1058 0.0875 0.0902 0.0933 0.0783 0.0937 0.0919 0.0772 0.1042 0.0897 0.0910 0.1237 0.1187 0.1252 0.1263 0.1286 0.1376 0.1256 0.1314 0.1264 0.1264
va: 2.1035 2.1142 2.1147 3.1240 3.7147 3.7558 3.9259 3.9189 3.9097 3.9053 3.9251 4.1629 3.8192 3.6980 3.9982 3.9988 4.0100 3.8688 3.9559 4.0321 3.7935 3.9496 4.0443 3.9453 3.9292 3.9622 1.0330 1.0033 1.0171 0.9992 1.0059 1.0016 1.0096 1.0006 1.0063 1.0103 1.0163 1.0031 0.9993 1.0323 1.0129 1.0187 1.0006 1.0116 1.0030 1.0138 0.9990 0.9987 1.0003
dispcorr: -0.023282530 hartree
energy: -1132.697991203357
dipole: 24.56002 -24.14316 0.41686 23.86055 -23.02795 0.83259 5.12550 -4.26814 0.85736
magnitude: 1.26572 au
magnitude: 3.21721 debye
