program: Orca
programVersion: 5.0.2
elementType: O O O N C C C C C C C C C C C C C C C C C C C C C C H H H H H H H H H H H H H H H H H H H H H H H
charge: 0
multiplicity: 1
keywords: wb97x-d3
keywords: def2-TZVPP
keywords: def2/J RIJCOSX
keywords: DEFGRID2
keywords: scfconv7
keywords: smallprint printgap noloewdin
keywords: NOSOSCF
formula: C22H23NO3
InChI: InChI=1/C22H23NO3/c1-21(2)19(22(21,3)4)20(24)26-18(14-23)15-9-8-12-17(13-15)25-16-10-6-5-7-11-16/h5-13,18-19H,1-4H3
49 atoms
O  0.46007 1.65351 0.755605
O  0.722298 2.627186 -1.235686
O  -2.144966 -2.5760 -0.771191
N  -1.848193 1.780918 3.124639
C  3.431462 0.996428 -1.256591
C  3.797327 2.33557 -0.696931
C  2.595662 1.592499 -0.1261
C  2.860557 0.873994 -2.651204
C  4.245272 -0.227973 -0.894803
C  4.985474 2.46782 0.23288
C  3.62092 3.590858 -1.521029
C  1.201953 2.02758 -0.312767
C  -0.922402 1.957777 0.686469
C  -1.680286 1.013863 -0.217621
C  -1.420932 1.854595 2.060936
C  -1.536507 -0.356889 -0.042614
C  -2.515477 1.51709 -1.20098
C  -2.254541 -1.224294 -0.853398
C  -3.223707 0.639606 -2.008752
C  -3.102238 -0.727087 -1.837357
C  -1.860215 -3.179627 0.422145
C  -2.530959 -2.848594 1.593046
C  -0.909985 -4.18935 0.413493
C  -2.235238 -3.535671 2.759632
C  -0.6335 -4.877334 1.58524
C  -1.289001 -4.550764 2.762694
H  2.762897 1.135636 0.843122
H  2.257209 -0.0319 -2.732434
H  2.233832 1.704905 -2.956885
H  3.676994 0.78761 -3.370931
H  4.598697 -0.228489 0.134142
H  3.646945 -1.130465 -1.029049
H  5.118435 -0.312714 -1.544744
H  5.913441 2.539202 -0.33785
H  4.896005 3.377399 0.828751
H  5.088866 1.637917 0.928846
H  3.482734 4.453927 -0.867546
H  4.52666 3.767236 -2.104732
H  2.781288 3.568688 -2.206538
H  -1.07713 2.988017 0.348995
H  -0.874114 -0.74238 0.722992
H  -2.606721 2.585568 -1.344652
H  -3.877049 1.024499 -2.77997
H  -3.653751 -1.417455 -2.461698
H  -3.276018 -2.063089 1.598235
H  -0.401674 -4.435455 -0.509634
H  -2.754524 -3.274634 3.672096
H  0.104226 -5.668967 1.575596
H  -1.067244 -5.084662 3.676597
totalener: -1132.67516520 hartree
nucrepener: 2254.14696417 hartree
electener: -3386.82212937 hartree
oneelecener: -6016.98335360 hartree
twoeener: 2630.16122423 hartree
kineticenergy: 1127.72355062 hartree
xcener: -110.666560056345 hartree
chargesum: -0.0000000
charge: -0.277333 -0.382063 -0.297708 -0.005884 0.080738 0.085191 -0.117140 -0.274565 -0.256567 -0.255268 -0.272491 0.327841 0.331565 0.046936 -0.256586 -0.212138 -0.146302 0.231082 -0.087037 -0.207293 0.253910 -0.175268 -0.215863 -0.104811 -0.089856 -0.145541 0.078015 0.089127 0.105062 0.090116 0.078373 0.090701 0.092835 0.092599 0.090428 0.078393 0.087371 0.087290 0.104007 0.119348 0.132389 0.106636 0.126651 0.128226 0.136046 0.124961 0.131536 0.125621 0.126719
qa: -0.2773 -0.3821 -0.2977 -0.0059 0.0807 0.0852 -0.1171 -0.2746 -0.2566 -0.2553 -0.2725 0.3278 0.3316 0.0469 -0.2566 -0.2121 -0.1463 0.2311 -0.0870 -0.2073 0.2539 -0.1753 -0.2159 -0.1048 -0.0899 -0.1455 0.0780 0.0891 0.1051 0.0901 0.0784 0.0907 0.0928 0.0926 0.0904 0.0784 0.0874 0.0873 0.1040 0.1193 0.1324 0.1066 0.1267 0.1282 0.1360 0.1250 0.1315 0.1256 0.1267
va: 2.1206 2.1148 2.1164 3.1231 3.7381 3.7290 3.9300 3.9232 3.9058 3.9060 3.9195 4.1789 3.8385 3.6505 4.0234 3.9516 4.0219 3.8408 3.9546 4.0365 3.7898 3.9596 4.0464 3.9467 3.9294 3.9641 1.0330 1.0033 1.0169 0.9991 1.0100 1.0064 1.0010 1.0009 1.0061 1.0100 1.0037 0.9991 1.0179 1.0210 1.0209 1.0150 1.0000 1.0118 1.0033 1.0139 0.9991 0.9989 1.0003
dispcorr: -0.024013550 hartree
energy: -1132.699178747387
dipole: 29.65477 -28.65853 0.99624 4.94537 -5.29306 -0.34768 -9.33614 8.49424 -0.84190
magnitude: 1.34988 au
magnitude: 3.43112 debye
