program: Orca
programVersion: 5.0.2
elementType: O O O N C C C C C C C C C C C C C C C C C C C C C C H H H H H H H H H H H H H H H H H H H H H H H
charge: 0
multiplicity: 1
keywords: wb97x-d3
keywords: def2-TZVPP
keywords: def2/J RIJCOSX
keywords: DEFGRID2
keywords: scfconv7
keywords: smallprint printgap noloewdin
keywords: NOSOSCF
formula: C22H23NO3
InChI: InChI=1/C22H23NO3/c1-21(2)19(22(21,3)4)20(24)26-18(14-23)15-9-8-12-17(13-15)25-16-10-6-5-7-11-16/h5-13,18-19H,1-4H3
49 atoms
O  0.155789 2.557838 0.655043
O  0.657634 2.190735 -1.488465
O  -1.904689 -2.002359 1.250618
N  -2.407183 3.844983 2.298028
C  3.123281 0.69206 -0.148138
C  3.638397 2.03282 -0.572947
C  2.343564 1.956222 0.218867
C  2.563566 -0.278915 -1.163395
C  3.769933 -0.046769 1.003654
C  4.808909 2.656894 0.159421
C  3.647049 2.433538 -2.031687
C  1.0126 2.235344 -0.34293
C  -1.200938 2.706302 0.278645
C  -1.85231 1.38096 -0.046648
C  -1.861115 3.343254 1.42103
C  -1.585532 0.271132 0.744409
C  -2.698016 1.273382 -1.137659
C  -2.168068 -0.945201 0.432068
C  -3.290879 0.053694 -1.430026
C  -3.029265 -1.061085 -0.653315
C  -1.483199 -3.183771 0.713962
C  -1.814029 -4.339471 1.408754
C  -0.716364 -3.253098 -0.442962
C  -1.374156 -5.567407 0.942781
C  -0.290802 -4.49128 -0.901001
C  -0.615507 -5.651952 -0.215817
H  2.425625 2.242518 1.261844
H  3.374894 -0.876108 -1.583822
H  1.871137 -0.968759 -0.676264
H  2.031689 0.186262 -1.986965
H  4.102496 0.604487 1.809065
H  3.066717 -0.760584 1.435557
H  4.637497 -0.610667 0.655154
H  5.753871 2.258276 -0.214084
H  4.81941 3.735481 -0.004562
H  4.78543 2.498182 1.23557
H  4.595243 2.131039 -2.480361
H  2.845693 2.006692 -2.623849
H  3.574456 3.518218 -2.124639
H  -1.296901 3.378075 -0.581485
H  -0.926472 0.337417 1.600978
H  -2.887969 2.133866 -1.765941
H  -3.956366 -0.031633 -2.278311
H  -3.487735 -2.013274 -0.886847
H  -2.410154 -4.267049 2.308793
H  -0.449293 -2.354903 -0.985032
H  -1.634104 -6.465387 1.487501
H  0.306007 -4.542688 -1.802072
H  -0.279333 -6.613078 -0.579744
totalener: -1132.67382551 hartree
nucrepener: 2268.81721800 hartree
electener: -3401.49104350 hartree
oneelecener: -6046.00987348 hartree
twoeener: 2644.51882997 hartree
kineticenergy: 1127.72838990 hartree
xcener: -110.667144433860 hartree
chargesum: -0.0000000
charge: -0.272316 -0.373827 -0.298142 -0.001033 0.078156 0.095887 -0.110685 -0.274451 -0.254432 -0.259368 -0.270962 0.301790 0.316298 0.053594 -0.253726 -0.211735 -0.133953 0.183018 -0.104238 -0.140310 0.249846 -0.205364 -0.165211 -0.093917 -0.134927 -0.140779 0.079419 0.095833 0.075635 0.104934 0.078640 0.093307 0.093012 0.093039 0.091577 0.078750 0.086555 0.104064 0.088576 0.121865 0.126317 0.106196 0.129578 0.137043 0.127149 0.131836 0.126153 0.126330 0.124978
qa: -0.2723 -0.3738 -0.2981 -0.0010 0.0782 0.0959 -0.1107 -0.2745 -0.2544 -0.2594 -0.2710 0.3018 0.3163 0.0536 -0.2537 -0.2117 -0.1340 0.1830 -0.1042 -0.1403 0.2498 -0.2054 -0.1652 -0.0939 -0.1349 -0.1408 0.0794 0.0958 0.0756 0.1049 0.0786 0.0933 0.0930 0.0930 0.0916 0.0788 0.0866 0.1041 0.0886 0.1219 0.1263 0.1062 0.1296 0.1370 0.1271 0.1318 0.1262 0.1263 0.1250
va: 2.1121 2.1197 2.1059 3.1224 3.7508 3.7338 3.9178 3.9260 3.9043 3.9060 3.9154 4.2005 3.8364 3.6483 4.0211 4.0472 4.0317 3.8920 3.9552 3.9681 3.7935 4.0261 3.9056 3.9438 3.9791 3.9597 1.0328 1.0016 1.0039 1.0152 1.0100 1.0056 1.0011 1.0011 1.0058 1.0096 0.9991 1.0169 1.0038 1.0185 1.0297 1.0131 1.0006 1.0007 1.0136 1.0037 0.9985 1.0010 1.0004
dispcorr: -0.025058447 hartree
energy: -1132.698883952572
dipole: 29.47731 -28.37627 1.10104 -4.12277 3.00527 -1.11750 -8.76499 7.70798 -1.05701
magnitude: 1.89165 au
magnitude: 4.80820 debye
