program: Orca
programVersion: 5.0.2
elementType: O O O N C C C C C C C C C C C C C C C C C C C C C C H H H H H H H H H H H H H H H H H H H H H H H
charge: 0
multiplicity: 1
keywords: wb97x-d3
keywords: def2-TZVPP
keywords: def2/J RIJCOSX
keywords: DEFGRID2
keywords: scfconv7
keywords: smallprint printgap noloewdin
keywords: NOSOSCF
formula: C22H23NO3
InChI: InChI=1/C22H23NO3/c1-21(2)19(22(21,3)4)20(24)26-18(14-23)15-9-8-12-17(13-15)25-16-10-6-5-7-11-16/h5-13,18-19H,1-4H3
49 atoms
O  0.489305 1.641762 0.746029
O  0.723804 2.648123 -1.232657
O  -2.132655 -2.596408 -0.76393
N  -1.795865 1.724077 3.140005
C  3.459434 1.066505 -1.302664
C  3.806926 2.395149 -0.707426
C  2.617881 1.61839 -0.154278
C  2.887763 0.973244 -2.699171
C  4.291989 -0.154988 -0.975752
C  4.995705 2.520005 0.222396
C  3.608372 3.668939 -1.49715
C  1.217638 2.039505 -0.323069
C  -0.89719 1.933098 0.694362
C  -1.653437 0.991591 -0.213295
C  -1.380256 1.813155 2.073027
C  -1.523356 -0.379689 -0.03105
C  -2.468049 1.497392 -1.212694
C  -2.233784 -1.24444 -0.851219
C  -3.169683 0.622498 -2.028886
C  -3.061131 -0.744451 -1.850812
C  -1.896583 -3.201657 0.438833
C  -2.599443 -2.858615 1.587198
C  -0.963272 -4.226939 0.461545
C  -2.353847 -3.550295 2.762651
C  -0.736914 -4.918812 1.64154
C  -1.425476 -4.581116 2.796841
H  2.795296 1.138032 0.801662
H  3.703848 0.911287 -3.421604
H  2.29209 0.064571 -2.801639
H  2.253518 1.805806 -2.983718
H  4.642082 -0.181182 0.053989
H  3.708777 -1.062484 -1.139545
H  5.168596 -0.205856 -1.624683
H  5.115153 1.671589 0.893021
H  5.920309 2.623583 -0.348837
H  4.893381 3.409947 0.845238
H  3.465259 4.513077 -0.820528
H  4.506443 3.871482 -2.084127
H  2.762822 3.653455 -2.175613
H  -1.064855 2.965276 0.369184
H  -0.87722 -0.768128 0.747055
H  -2.547757 2.565907 -1.362152
H  -3.807091 1.009468 -2.812305
H  -3.607039 -1.432974 -2.482065
H  -3.331629 -2.061279 1.568129
H  -0.428995 -4.482031 -0.44428
H  -2.898825 -3.280376 3.657382
H  -0.012467 -5.722572 1.656111
H  -1.243231 -5.118572 3.717347
totalener: -1132.67521964 hartree
nucrepener: 2250.22036291 hartree
electener: -3382.89558255 hartree
oneelecener: -6009.14317038 hartree
twoeener: 2626.24758783 hartree
kineticenergy: 1127.72497107 hartree
xcener: -110.666750588714 hartree
chargesum: 0.0000000
charge: -0.276369 -0.383401 -0.297972 -0.005562 0.080252 0.084825 -0.116910 -0.274275 -0.257249 -0.254189 -0.273097 0.330398 0.332477 0.042202 -0.257497 -0.208200 -0.142336 0.227177 -0.088122 -0.206377 0.252359 -0.172410 -0.216121 -0.105012 -0.089816 -0.145608 0.077835 0.089926 0.089573 0.104795 0.078626 0.090817 0.092867 0.077876 0.092457 0.090425 0.087321 0.087564 0.104075 0.118504 0.132283 0.107271 0.126900 0.128309 0.135385 0.124859 0.131253 0.125333 0.126578
qa: -0.2764 -0.3834 -0.2980 -0.0056 0.0803 0.0848 -0.1169 -0.2743 -0.2572 -0.2542 -0.2731 0.3304 0.3325 0.0422 -0.2575 -0.2082 -0.1423 0.2272 -0.0881 -0.2064 0.2524 -0.1724 -0.2161 -0.1050 -0.0898 -0.1456 0.0778 0.0899 0.0896 0.1048 0.0786 0.0908 0.0929 0.0779 0.0925 0.0904 0.0873 0.0876 0.1041 0.1185 0.1323 0.1073 0.1269 0.1283 0.1354 0.1249 0.1313 0.1253 0.1266
va: 2.1230 2.1139 2.1151 3.1229 3.7368 3.7295 3.9307 3.9231 3.9061 3.9061 3.9197 4.1766 3.8403 3.6482 4.0233 3.9545 4.0159 3.8426 3.9547 4.0367 3.7920 3.9572 4.0455 3.9479 3.9303 3.9641 1.0332 0.9992 1.0031 1.0168 1.0099 1.0064 1.0009 1.0102 1.0011 1.0061 1.0036 0.9991 1.0179 1.0208 1.0204 1.0156 1.0000 1.0117 1.0035 1.0140 0.9992 0.9989 1.0003
dispcorr: -0.023962799 hartree
energy: -1132.699182434140
dipole: 29.56213 -28.58628 0.97585 5.52958 -5.84635 -0.31677 -9.54198 8.68347 -0.85850
magnitude: 1.33778 au
magnitude: 3.40036 debye
