program: Orca
programVersion: 5.0.2
elementType: O O O N C C C C C C C C C C C C C C C C C C C C C C H H H H H H H H H H H H H H H H H H H H H H H
charge: 0
multiplicity: 1
keywords: wb97x-d3
keywords: def2-TZVPP
keywords: def2/J RIJCOSX
keywords: DEFGRID2
keywords: scfconv7
keywords: smallprint printgap noloewdin
keywords: NOSOSCF
formula: C22H23NO3
InChI: InChI=1/C22H23NO3/c1-21(2)19(22(21,3)4)20(24)26-18(14-23)15-9-8-12-17(13-15)25-16-10-6-5-7-11-16/h5-13,18-19H,1-4H3
49 atoms
O  0.899892 1.21546 0.493016
O  0.816262 3.014589 -0.833527
O  -2.475832 -2.861158 -0.655216
N  -0.754113 0.695222 3.318655
C  3.608344 2.082879 -1.883977
C  3.958383 2.832745 -0.636827
C  2.861778 1.770191 -0.59285
C  2.920839 2.781279 -3.03538
C  4.523237 0.987475 -2.390966
C  5.225551 2.50084 0.121418
C  3.614844 4.298848 -0.498812
C  1.445443 2.101749 -0.368188
C  -0.474442 1.392142 0.815293
C  -1.360564 0.584185 -0.10114
C  -0.617922 0.990833 2.217086
C  -1.504106 -0.784012 0.093776
C  -1.992161 1.213943 -1.16481
C  -2.304678 -1.51829 -0.770491
C  -2.777086 0.466248 -2.029864
C  -2.942272 -0.893444 -1.835867
C  -2.451215 -3.45163 0.57923
C  -1.698849 -4.606643 0.723663
C  -3.192622 -2.951456 1.64217
C  -1.690747 -5.266779 1.943513
C  -3.165437 -3.614081 2.858724
C  -2.416236 -4.771389 3.01604
H  3.15518 0.843673 -0.111912
H  2.351969 2.061293 -3.625963
H  2.234916 3.567466 -2.741333
H  3.673945 3.220011 -3.69287
H  3.971286 0.313021 -3.047505
H  5.344278 1.412349 -2.971749
H  4.957612 0.379629 -1.599912
H  5.462502 1.439123 0.129255
H  6.078929 3.027246 -0.31061
H  5.135778 2.818681 1.16129
H  2.692119 4.594228 -0.98651
H  3.524465 4.566047 0.555586
H  4.422398 4.901793 -0.918472
H  -0.748514 2.449013 0.746599
H  -1.006388 -1.27232 0.923327
H  -1.864767 2.276506 -1.321123
H  -3.275125 0.950555 -2.858947
H  -3.563811 -1.478886 -2.50049
H  -1.131022 -4.983388 -0.116827
H  -3.783986 -2.052447 1.524666
H  -1.105567 -6.169916 2.055112
H  -3.737192 -3.220597 3.688438
H  -2.400328 -5.283921 3.968124
totalener: -1132.67603355 hartree
nucrepener: 2212.58093810 hartree
electener: -3345.25697165 hartree
oneelecener: -5933.92722990 hartree
twoeener: 2588.67025825 hartree
kineticenergy: 1127.72063386 hartree
xcener: -110.666381097826 hartree
chargesum: -0.0000000
charge: -0.266071 -0.405299 -0.298474 -0.006750 0.085888 0.078391 -0.125990 -0.273009 -0.256445 -0.254409 -0.278512 0.365368 0.333056 0.004954 -0.261789 -0.177850 -0.139103 0.208741 -0.095756 -0.197048 0.234515 -0.205381 -0.158282 -0.093376 -0.101623 -0.140321 0.076474 0.087958 0.103521 0.088116 0.090557 0.092405 0.078194 0.077965 0.091987 0.092116 0.104561 0.089280 0.090348 0.118191 0.127898 0.124113 0.127436 0.127928 0.125057 0.131547 0.125101 0.128072 0.125751
qa: -0.2661 -0.4053 -0.2985 -0.0068 0.0859 0.0784 -0.1260 -0.2730 -0.2564 -0.2544 -0.2785 0.3654 0.3331 0.0050 -0.2618 -0.1778 -0.1391 0.2087 -0.0958 -0.1970 0.2345 -0.2054 -0.1583 -0.0934 -0.1016 -0.1403 0.0765 0.0880 0.1035 0.0881 0.0906 0.0924 0.0782 0.0780 0.0920 0.0921 0.1046 0.0893 0.0903 0.1182 0.1279 0.1241 0.1274 0.1279 0.1251 0.1315 0.1251 0.1281 0.1258
va: 2.1294 2.0863 2.1124 3.1168 3.7192 3.7326 3.9374 3.9192 3.9077 3.9063 3.9238 4.1516 3.8156 3.6926 4.0265 3.9872 3.9703 3.8672 3.9563 4.0347 3.8120 4.0422 3.9556 3.9336 3.9518 3.9635 1.0336 1.0034 1.0174 0.9990 1.0061 1.0010 1.0102 1.0103 1.0010 1.0059 1.0165 1.0029 0.9994 1.0254 1.0159 1.0210 0.9998 1.0118 1.0133 1.0035 0.9991 1.0000 1.0004
dispcorr: -0.023554464 hartree
energy: -1132.699588016450
dipole: 28.32427 -27.65468 0.66959 13.50676 -13.55033 -0.04357 -11.47725 10.45017 -1.02708
magnitude: 1.22684 au
magnitude: 3.11839 debye
