program: Orca
programVersion: 5.0.2
elementType: O O O N C C C C C C C C C C C C C C C C C C C C C C H H H H H H H H H H H H H H H H H H H H H H H
charge: 0
multiplicity: 1
keywords: wb97x-d3
keywords: def2-TZVPP
keywords: def2/J RIJCOSX
keywords: DEFGRID2
keywords: scfconv7
keywords: smallprint printgap noloewdin
keywords: NOSOSCF
formula: C22H23NO3
InChI: InChI=1/C22H23NO3/c1-21(2)19(22(21,3)4)20(24)26-18(14-23)15-9-8-12-17(13-15)25-16-10-6-5-7-11-16/h5-13,18-19H,1-4H3
49 atoms
O  -0.007569 2.0162 0.588437
O  0.927558 2.005975 -1.445895
O  -2.261682 -2.236145 -0.988882
N  -2.118181 4.35949 1.590711
C  2.948554 0.081687 0.106308
C  3.628098 1.406727 -0.042496
C  2.205426 1.364658 0.490466
C  2.515338 -0.706884 -1.109159
C  3.316635 -0.841415 1.246832
C  4.680731 1.82875 0.9620
C  3.945017 1.9626 -1.413277
C  1.031323 1.829348 -0.263068
C  -1.238937 2.44733 0.041307
C  -2.230381 1.305549 -0.082708
C  -1.72875 3.511962 0.920703
C  -1.76946 0.045016 -0.435674
C  -3.593025 1.523346 0.077085
C  -2.672171 -0.994847 -0.606149
C  -4.484829 0.479428 -0.114963
C  -4.033578 -0.786152 -0.447961
C  -1.175806 -2.812574 -0.39811
C  -0.380377 -3.622477 -1.196982
C  -0.889776 -2.659318 0.953556
C  0.699474 -4.287493 -0.637891
C  0.197862 -3.326078 1.496825
C  0.997176 -4.14107 0.70872
H  2.104937 1.518194 1.559338
H  1.718489 -1.403611 -0.839391
H  2.157665 -0.100885 -1.936041
H  3.352139 -1.304673 -1.47561
H  3.53469 -0.321032 2.177088
H  2.498926 -1.536217 1.443437
H  4.1955 -1.434708 0.985762
H  4.815096 2.911125 0.929343
H  4.433382 1.568644 1.989125
H  5.643192 1.370597 0.72577
H  3.946222 3.053185 -1.389245
H  4.947347 1.641286 -1.703696
H  3.259086 1.659329 -2.195502
H  -1.077364 2.883411 -0.951545
H  -0.7167 -0.149095 -0.589144
H  -3.96727 2.499195 0.357499
H  -5.544738 0.652752 0.012712
H  -4.723353 -1.607683 -0.587702
H  -0.617788 -3.732076 -2.246742
H  -1.511578 -2.035179 1.581937
H  1.314195 -4.920428 -1.263762
H  0.413239 -3.212235 2.551117
H  1.841276 -4.660238 1.141611
totalener: -1132.67466952 hartree
nucrepener: 2324.80862937 hartree
electener: -3457.48329889 hartree
oneelecener: -6157.82468171 hartree
twoeener: 2700.34138282 hartree
kineticenergy: 1127.71811363 hartree
xcener: -110.670298361281 hartree
chargesum: 0.0000000
charge: -0.266262 -0.372252 -0.296544 -0.006449 0.110047 0.097863 -0.105053 -0.258268 -0.253563 -0.262297 -0.271425 0.269245 0.364290 -0.035660 -0.249367 -0.121473 -0.180126 0.198995 -0.088273 -0.187726 0.217049 -0.177803 -0.129011 -0.097358 -0.152705 -0.145974 0.075331 0.029232 0.111508 0.100282 0.080100 0.079343 0.093357 0.092894 0.077399 0.093337 0.090763 0.085611 0.101977 0.127815 0.131985 0.125140 0.129544 0.128538 0.125774 0.131680 0.124439 0.136117 0.127934
qa: -0.2663 -0.3723 -0.2965 -0.0064 0.1100 0.0979 -0.1051 -0.2583 -0.2536 -0.2623 -0.2714 0.2692 0.3643 -0.0357 -0.2494 -0.1215 -0.1801 0.1990 -0.0883 -0.1877 0.2170 -0.1778 -0.1290 -0.0974 -0.1527 -0.1460 0.0753 0.0292 0.1115 0.1003 0.0801 0.0793 0.0934 0.0929 0.0774 0.0933 0.0908 0.0856 0.1020 0.1278 0.1320 0.1251 0.1295 0.1285 0.1258 0.1317 0.1244 0.1361 0.1279
va: 2.1101 2.1169 2.1158 3.1130 3.6963 3.7340 3.9156 3.9199 3.8963 3.9054 3.9145 4.2346 3.7795 3.8469 4.0162 3.9352 4.0112 3.8699 3.9653 4.0324 3.8276 3.9744 3.8881 3.9086 3.9052 3.8954 1.0347 1.0272 1.0170 1.0035 1.0139 1.0239 1.0011 1.0055 1.0101 1.0006 1.0038 0.9989 1.0173 1.0231 0.9828 1.0220 1.0001 1.0116 1.0142 1.0048 0.9997 0.9985 1.0004
dispcorr: -0.027631789 hartree
energy: -1132.702301308213
dipole: 29.70974 -28.82458 0.88516 -6.57888 5.16717 -1.41171 0.48290 -0.55985 -0.07694
magnitude: 1.66804 au
magnitude: 4.23982 debye
