program: Orca
programVersion: 5.0.2
elementType: O O O N C C C C C C C C C C C C C C C C C C C C C C H H H H H H H H H H H H H H H H H H H H H H H
charge: 0
multiplicity: 1
keywords: wb97x-d3
keywords: def2-TZVPP
keywords: def2/J RIJCOSX
keywords: DEFGRID2
keywords: scfconv7
keywords: smallprint printgap noloewdin
keywords: NOSOSCF
formula: C22H23NO3
InChI: InChI=1/C22H23NO3/c1-21(2)19(22(21,3)4)20(24)26-18(14-23)15-9-8-12-17(13-15)25-16-10-6-5-7-11-16/h5-13,18-19H,1-4H3
49 atoms
O  0.718244 1.314922 0.641777
O  0.818674 2.968474 -0.858899
O  -2.55568 -2.687596 -0.664517
N  -1.18149 1.034876 3.345011
C  3.528219 1.675062 -1.734568
C  3.934362 2.534507 -0.578118
C  2.745295 1.588888 -0.429817
C  2.914914 2.288149 -2.972905
C  4.34043 0.447338 -2.089502
C  5.159033 2.182197 0.238905
C  3.723761 4.031046 -0.619382
C  1.359195 2.062311 -0.283369
C  -0.659923 1.595155 0.846273
C  -1.523617 0.782447 -0.086767
C  -0.935681 1.274988 2.249091
C  -1.628171 -0.591526 0.101969
C  -2.167625 1.401979 -1.145677
C  -2.407052 -1.342291 -0.765746
C  -2.935602 0.637245 -2.013521
C  -3.06286 -0.726083 -1.827942
C  -2.278997 -3.319329 0.519093
C  -1.312648 -4.311575 0.519096
C  -2.980937 -3.01087 1.676646
C  -1.051402 -5.008101 1.690216
C  -2.702204 -3.705127 2.842721
C  -1.739334 -4.704594 2.854673
H  2.946927 0.703608 0.163033
H  3.709808 2.564659 -3.668467
H  2.279204 1.559085 -3.477967
H  2.309838 3.168875 -2.790325
H  5.197971 0.719921 -2.707889
H  4.716395 -0.093206 -1.223271
H  3.729897 -0.251284 -2.663675
H  5.295183 1.112331 0.381768
H  6.061431 2.569971 -0.237897
H  5.091837 2.632773 1.230397
H  2.839504 4.346111 -1.16282
H  3.638603 4.426076 0.394529
H  4.589529 4.507952 -1.082704
H  -0.862414 2.660526 0.70176
H  -1.113074 -1.065904 0.928552
H  -2.064523 2.467707 -1.298656
H  -3.444975 1.111354 -2.841605
H  -3.666972 -1.324319 -2.497271
H  -0.778499 -4.537603 -0.394269
H  -3.735273 -2.23456 1.667332
H  -0.300244 -5.786655 1.690759
H  -3.243507 -3.462326 3.747123
H  -1.528679 -5.244269 3.76786
totalener: -1132.67616671 hartree
nucrepener: 2229.30038931 hartree
electener: -3361.97655602 hartree
oneelecener: -5967.37624432 hartree
twoeener: 2605.39968830 hartree
kineticenergy: 1127.73160786 hartree
xcener: -110.668170561564 hartree
chargesum: -0.0000000
charge: -0.268715 -0.399928 -0.296012 -0.007459 0.079767 0.079161 -0.116980 -0.271832 -0.255989 -0.254622 -0.277427 0.355283 0.338521 -0.005212 -0.264792 -0.180132 -0.141851 0.229384 -0.086675 -0.206874 0.228166 -0.188622 -0.163466 -0.103484 -0.103943 -0.132258 0.075283 0.087692 0.089065 0.103987 0.092096 0.077644 0.090620 0.077592 0.092632 0.091395 0.103976 0.089205 0.089313 0.116874 0.125293 0.118359 0.126552 0.127004 0.125055 0.133595 0.125907 0.129710 0.127144
qa: -0.2687 -0.3999 -0.2960 -0.0075 0.0798 0.0792 -0.1170 -0.2718 -0.2560 -0.2546 -0.2774 0.3553 0.3385 -0.0052 -0.2648 -0.1801 -0.1419 0.2294 -0.0867 -0.2069 0.2282 -0.1886 -0.1635 -0.1035 -0.1039 -0.1323 0.0753 0.0877 0.0891 0.1040 0.0921 0.0776 0.0906 0.0776 0.0926 0.0914 0.1040 0.0892 0.0893 0.1169 0.1253 0.1184 0.1266 0.1270 0.1251 0.1336 0.1259 0.1297 0.1271
va: 2.1321 2.0923 2.1164 3.1194 3.7280 3.7329 3.9305 3.9196 3.9072 3.9056 3.9243 4.1625 3.8207 3.7067 4.0290 3.9746 3.9863 3.8541 3.9535 4.0340 3.8148 4.0387 3.9815 3.9354 3.9490 3.9557 1.0335 0.9990 1.0032 1.0174 1.0012 1.0105 1.0059 1.0103 1.0007 1.0061 1.0169 1.0027 0.9994 1.0250 1.0197 1.0200 0.9997 1.0127 1.0124 1.0033 0.9994 0.9997 1.0001
dispcorr: -0.023690885 hartree
energy: -1132.699857598172
dipole: 29.50868 -28.67636 0.83232 9.92800 -10.20241 -0.27441 -11.23266 10.25454 -0.97813
magnitude: 1.31331 au
magnitude: 3.33818 debye
