program: Orca
programVersion: 5.0.2
elementType: Cl Cl O O N C C C C C C C C C C C C C C H H H H H H H H H H H H H H H H H
charge: 0
multiplicity: 1
keywords: wb97x-d3
keywords: def2-TZVPP
keywords: def2/J RIJCOSX
keywords: DEFGRID2
keywords: scfconv7
keywords: smallprint printgap noloewdin
keywords: NOSOSCF
formula: C14H17Cl2NO2
InChI: InChI=1/C14H17Cl2NO2/c1-14(7-3-2-4-8-14)13(19)17-9-5-6-10(18)12(16)11(9)15/h5-6,17-18H,2-4,7-8H2,1H3
36 atoms
Cl -1.414823 -2.100881 -0.174469
Cl -4.305488 -1.107153 0.220874
O  1.880595 1.880835 -0.617046
O  -4.552082 1.883583 0.347884
N  0.641817 -0.002428 -0.376741
C  3.038672 -0.239393 -0.756079
C  4.325684 0.579161 -0.584686
C  3.087514 -1.413743 0.236208
C  4.584673 1.026844 0.851095
C  3.285362 -0.961624 1.677617
C  4.567396 -0.150198 1.818878
C  2.964907 -0.777391 -2.191264
C  1.814153 0.66333 -0.556907
C  -0.648174 0.500895 -0.204958
C  -1.710352 -0.402694 -0.091864
C  -0.959345 1.85949 -0.123395
C  -3.019329 0.03345 0.090888
C  -2.258388 2.288676 0.059902
C  -3.312115 1.392037 0.170463
H  4.3285 1.435727 -1.261244
H  5.152485 -0.062552 -0.905692
H  3.935084 -2.040892 -0.058513
H  2.213241 -2.066027 0.149842
H  3.83847 1.762579 1.160459
H  5.550571 1.53505 0.898236
H  3.316813 -1.835352 2.332162
H  2.430055 -0.362139 2.00722
H  5.425237 -0.799771 1.615887
H  4.680407 0.204348 2.845976
H  3.852978 -1.374432 -2.40233
H  2.093568 -1.41578 -2.346183
H  2.92671 0.032587 -2.921407
H  0.712543 -1.008256 -0.391182
H  -0.183867 2.601073 -0.201466
H  -2.463709 3.349291 0.119038
H  -5.215489 1.18386 0.400353
elementType: Cl O N C H
totalener: -1669.47152330 hartree
nucrepener: 1738.79037853 hartree
electener: -3408.26190183 hartree
oneelecener: -5745.62810149 hartree
twoeener: 2337.36619966 hartree
cpcmener: -0.02370348 hartree
kineticenergy: 1664.78643635 hartree
xcener: -115.364350328574 hartree
chargesum: 0.0000000
charge: -0.071551 -0.070044 -0.522686 -0.348393 -0.151658 0.365265 -0.258864 -0.239828 -0.139799 -0.119176 -0.135037 -0.328315 0.228021 0.193820 -0.088556 -0.217887 0.056150 -0.155299 0.184154 0.082757 0.090898 0.088972 0.083324 0.069466 0.076897 0.080864 0.062932 0.065846 0.074774 0.102855 0.102759 0.111840 0.174256 0.161556 0.145629 0.244059
qa: -0.0716 -0.0700 -0.5227 -0.3484 -0.1517 0.3653 -0.2589 -0.2398 -0.1398 -0.1192 -0.1350 -0.3283 0.2280 0.1938 -0.0886 -0.2179 0.0561 -0.1553 0.1842 0.0828 0.0909 0.0890 0.0833 0.0695 0.0769 0.0809 0.0629 0.0658 0.0748 0.1029 0.1028 0.1118 0.1743 0.1616 0.1456 0.2441
va: 1.2741 1.2701 1.9827 2.1418 3.2444 3.5641 3.9139 3.9399 3.8813 3.8782 3.8967 3.9205 4.1829 3.7740 3.9706 3.9972 3.8201 3.9723 4.0105 1.0265 1.0100 1.0117 1.0181 1.0239 1.0121 1.0100 1.0201 1.0106 1.0123 1.0027 1.0103 1.0039 1.0338 1.0329 1.0055 1.0158
dispcorr: -0.018328936 hartree
energy: -1669.489852238289
dipole: 47.79220 -47.68614 0.10606 5.41096 -6.97098 -1.56002 1.00234 -0.90512 0.09722
magnitude: 1.56664 au
magnitude: 3.98209 debye
